EMX2
type: SIO_000750
description: MOLGENIS EMX2 database at http://umcgresearchdatacatalogue.nl
creator: molgenis.org

catalogue_rdf
is part of: EMX2
type: Container
description: Temporary catalogue schema for rdf harvesting
contains: Endpoint
contains: Profiles
contains: Resources
contains: Samplesets
contains: Subpopulations
contains: Version
contains: Agents
contains: Collection events
contains: Contacts
contains: Datasets
contains: External identifiers
contains: Linkages
contains: Organisations
contains: Resource counts
contains: Subpopulation counts
contains: Variables
contains: Collections
contains: Documentation
contains: Networks
contains: Resource mappings
contains: Variable mappings
contains: Catalogues
contains: Internal identifiers
contains: Reused variables
contains: Dataset mappings
contains: Variable values
contains: Publications

Endpoint
type: Class
subclass of: DataSet
subclass of: Thing
description: General information describing an endpoint

Profiles
type: Class
subclass of: DataSet
subclass of: Thing
description: DataCatalogueFlat

Resources
type: Class
subclass of: DataSet
subclass of: Thing
description: Resource of data and/or samples. Use 'resource type' to specify

Samplesets
type: Class
subclass of: DataSet
subclass of: Thing
description: Definition of a sample set

Subpopulations
type: Class
subclass of: DataSet
subclass of: Thing
description: Subpopulations defined for this resource

Version
type: Class
subclass of: DataSet
subclass of: Thing
description: 8.0.0

Agents
type: Class
subclass of: DataSet
subclass of: Thing
description: An organisation, department or individual

Collection events
type: Class
subclass of: DataSet
subclass of: Thing
description: Definition of a collection event for a resource

Contacts
type: Class
subclass of: DataSet
subclass of: Thing
description: Listing of contact persons per resource

Datasets
type: Class
subclass of: DataSet
subclass of: Thing
description: Definition of a dataset

External identifiers
type: Class
subclass of: DataSet
subclass of: Thing
description: External identifier(s) for this resource

Linkages
type: Class
subclass of: DataSet
subclass of: Thing
description: Links between resources, e.g. data source and databank

Organisations
type: Class
subclass of: DataSet
subclass of: Agents
description: Research organisations, departments and research groups

Resource counts
type: Class
subclass of: DataSet
subclass of: Thing
description: Quantitative information on the resource

Subpopulation counts
type: Class
subclass of: DataSet
subclass of: Thing
description: Number of participants per cohort age group, optionally divided per sex

Variables
type: Class
subclass of: DataSet
subclass of: Thing
description: Definition of a variable

Collections
type: Class
subclass of: DataSet
subclass of: Resources
description: A collection of data and/or samples such as a cohort, registry or biobank

Documentation
type: Class
subclass of: DataSet
subclass of: Thing
description: Documentation attached to a resource

Networks
type: Class
subclass of: DataSet
subclass of: Resources
description: A network or consortium of data resources

Resource mappings
type: Class
subclass of: DataSet
subclass of: Thing
description: Mapping from collected resources to standard/harmonised resources, optionally including ETL syntaxes

Variable mappings
type: Class
subclass of: DataSet
subclass of: Thing
description: Mappings from collected or source variables to target or harmonised variables, optionally including ETL syntax

Catalogues
type: Class
subclass of: DataSet
subclass of: Networks
description: A catalogue of data resources

Internal identifiers
type: Class
subclass of: DataSet
subclass of: Thing
description: Internal identifier(s) for this resource

Reused variables
type: Class
subclass of: DataSet
subclass of: Thing
description: Listing of variables from another resource that are re-used by a resource

Dataset mappings
type: Class
subclass of: DataSet
subclass of: Thing
description: Mappings from collected or source datasets to harmonised or target datasets

Variable values
type: Class
subclass of: DataSet
subclass of: Thing
description: Listing of categorical value+label definition in case of a categorical variable

Publications
type: Class
subclass of: DataSet
subclass of: Thing
description: Publications based on doi

mg_draft
type: DatatypeProperty
range: boolean
domain: Endpoint

mg_insertedOn
type: DatatypeProperty
range: dateTime
domain: Endpoint

mg_updatedOn
type: DatatypeProperty
range: dateTime
domain: Endpoint

id
type: DatatypeProperty
range: string
domain: Endpoint
description: A unique proper name or character sequence that identifies this particular person. In Beacon v2: id, in FAIR Genomes: PersonalIdentifier. In RD3: subjectID.

type
type: ObjectProperty
domain: Endpoint
description: This row is an instance of one or more of these class(es) other than the Endpoint table.

name
type: DatatypeProperty
range: string
domain: Endpoint
description: A name given to the resource.

version
type: DatatypeProperty
range: string
domain: Endpoint
description: An account of the resource version.

description
type: DatatypeProperty
range: string
domain: Endpoint
description: An account of the resource.

publisher
type: ObjectProperty
range: Agents
domain: Endpoint
description: An entity responsible for making the resource available.

language
type: ObjectProperty
domain: Endpoint
description: A language of the resource.

license
type: ObjectProperty
domain: Endpoint
description: A legal document giving official permission to do something with the resource.

conformsTo
type: ObjectProperty
domain: Endpoint
description: An established standard to which the described resource conforms.

rights
type: ObjectProperty
domain: Endpoint
description: Information about rights held in and over the resource.

accessRights
type: ObjectProperty
domain: Endpoint
description: Information about who access the resource or an indication of its security status.

contact
type: ObjectProperty
range: Contacts
domain: Endpoint
description: Relevant contact information for the cataloged resource

keyword
type: DatatypeProperty
range: string
domain: Endpoint
description: A keyword or tag describing a resource.

theme
type: ObjectProperty
domain: Endpoint
description: A main category of the resource. A resource can have multiple themes.

endPointDescription
type: ObjectProperty
domain: Endpoint
description: A description of the service end-point, including its operations, parameters etc.

metadataCatalog
type: ObjectProperty
range: Resources
domain: Endpoint
description: With the definition of the FDP as a type of metadata service that serves metadata catalogs, the relation between the Metadata Service and dcat:Catalog is represented by this predicate.

conformsToFdpSpec
type: ObjectProperty
domain: Endpoint
description: The relation should point to an URI that contains the version of the FDP specifications for which this instance of the FDP conforms to

EJP_RD_personalData
type: DatatypeProperty
range: string
domain: Endpoint
description: Set to true if the resource onboarded to the EJP-RD Virtual Platform contains personal data, personal data meaning data related to identified or identifiable persons (as per GDPR definition), otherwise false. Must be String as workaround for current FDP reference implementation limitations.

EJP_RD_vpConnection
type: ObjectProperty
domain: Endpoint
description: This property must be attached to every entity that you wish the EJP-RD Virtual Platform to explore.

issued
type: DatatypeProperty
range: dateTime
domain: Endpoint

modified
type: DatatypeProperty
range: dateTime
domain: Endpoint

mg_draft
type: DatatypeProperty
range: boolean
domain: Profiles

mg_insertedOn
type: DatatypeProperty
range: dateTime
domain: Profiles

mg_updatedOn
type: DatatypeProperty
range: dateTime
domain: Profiles

DataCatalogueFlat
type: DatatypeProperty
range: string
domain: Profiles
description: DataCatalogueFlat

mg_draft
type: DatatypeProperty
range: boolean
domain: Resources

mg_insertedOn
type: DatatypeProperty
range: dateTime
domain: Resources

mg_updatedOn
type: DatatypeProperty
range: dateTime
domain: Resources

overview
type: DatatypeProperty
range: string
domain: Resources
description: General information

hricore
type: DatatypeProperty
range: boolean
domain: Resources
description: Do you want your metadata to be compatible with HRICore v2.0.1, so that the metadata can be shared with the Dutch National Health Data Catalogue?

id
type: DatatypeProperty
range: string
domain: Resources
description: Internal identifier

pid
type: DatatypeProperty
range: string
domain: Resources
description: Persistent identifier

name
type: DatatypeProperty
range: string
domain: Resources
description: Name used in international projects

local name
type: DatatypeProperty
range: string
domain: Resources
description: If different from above, name in the national language

acronym
type: DatatypeProperty
range: string
domain: Resources
description: Acronym, if applicable

website
type: ObjectProperty
domain: Resources
description: Link to the website or homepage

description
type: DatatypeProperty
range: string
domain: Resources
description: Short description

internal identifiers
type: ObjectProperty
range: Internal identifiers
domain: Resources
description: Internal identifier(s) for this resource (e.g. UMCG register number)

external identifiers
type: ObjectProperty
range: External identifiers
domain: Resources
description: External identifier(s) for this resource (e.g. EUPASS number or BBMRI persistent identifer)

start year
type: DatatypeProperty
range: int
domain: Resources
description: The year when the resource started, e.g. when data or samples started to be collected or extracted, or when the resource was established

end year
type: DatatypeProperty
range: int
domain: Resources
description: The year the resource ceased, e.g. when data or sample collection was stopped

contact email
type: DatatypeProperty
range: anyURI
domain: Resources
description: Contact e-mail address

logo
type: DatatypeProperty
range: anyURI
domain: Resources
description: Logo of the resource, for use on homepages etc.

issued
type: DatatypeProperty
range: dateTime
domain: Resources
description: When the data of the resource was first published

modified
type: DatatypeProperty
range: dateTime
domain: Resources
description: When the data of the resource was last modified

countries
type: ObjectProperty
range: Countries
domain: Resources
description: Countries where data/samples from this resource largely originate from

continents
type: ObjectProperty
range: Continents
domain: Resources
description: Continent(s) where data/samples from this resource originate from

counts
type: ObjectProperty
range: Resource counts
domain: Resources
description: Counts of e.g. samples defined for this resource

contributors
type: DatatypeProperty
range: string
domain: Resources
description: List of relevant collaborations

organisations involved
type: ObjectProperty
range: Organisations
domain: Resources
description: Organisations involved in this resource and their role(s)

publisher
type: ObjectProperty
range: Organisations
domain: Resources
description: From organisations involved, point out the organisation that published this resource

creator
type: ObjectProperty
range: Organisations
domain: Resources
description: From organisations involved, point out the organisation(s) that created this resource

people involved
type: ObjectProperty
range: Contacts
domain: Resources
description: Persons that contributed to this resource

contact point
type: ObjectProperty
range: Contacts
domain: Resources
description: From people involved, point out the primary contact point for this resource

datasets
type: ObjectProperty
range: Datasets
domain: Resources
description: List of datasets contained in this resouce if applicable

samplesets
type: ObjectProperty
range: Samplesets
domain: Resources
description: List of sample sets contained in this resource if applicable

linked resources
type: ObjectProperty
range: Linkages
domain: Resources
description: List of resources that are or can be linked to this main resource

standards
type: DatatypeProperty
range: string
domain: Resources
description: Use of standard data models and ontologies

mappings to common data models
type: ObjectProperty
range: Dataset mappings
domain: Resources
description: Overview of dataset mappings available

common data models other
type: DatatypeProperty
range: string
domain: Resources
description: If not in list above, give the name of cdm(s) used by this data source

information
type: DatatypeProperty
range: string
domain: Resources
description: Other information

publications
type: ObjectProperty
range: Publications
domain: Resources
description: Publication(s) about this resource

funding sources
type: ObjectProperty
range: FundingTypes
domain: Resources
description: Specify the main financial support sources for the data source in the last three years. Select all that apply

funding scheme
type: ObjectProperty
range: StudyFunding
domain: Resources
description: The source of funding for the study. Select all that apply

funding statement
type: DatatypeProperty
range: string
domain: Resources
description: Statement listing funding that was obtained for this resource

citation requirements
type: DatatypeProperty
range: string
domain: Resources
description: Citation regulation for this resource

acknowledgements
type: DatatypeProperty
range: string
domain: Resources
description: Acknowledgement statement and citation regulation for this resource

documentation
type: ObjectProperty
range: Documentation
domain: Resources
description: Descriptive document(s) available for this resource, e.g. informed consent

supplementary information
type: DatatypeProperty
range: string
domain: Resources
description: Any other information that needs to be disclosed for this resource

applicable legislation
type: ObjectProperty
range: Legislations
domain: Resources
description: The legislation that mandates the creation or management of the resource. For health datasets, the value must include the data governance act, which is set as a default. URI's to other legislations may be included

mg_tableclass
type: DatatypeProperty
range: string
domain: Resources

mg_draft
type: DatatypeProperty
range: boolean
domain: Samplesets

mg_insertedOn
type: DatatypeProperty
range: dateTime
domain: Samplesets

mg_updatedOn
type: DatatypeProperty
range: dateTime
domain: Samplesets

resource
type: ObjectProperty
range: Resources
domain: Samplesets
description: Resouce that these samples are part of

name
type: DatatypeProperty
range: string
domain: Samplesets
description: Sample set name

sample types
type: ObjectProperty
range: SampleTypes
domain: Samplesets
description: Defines the types of samples in the sample set

mg_draft
type: DatatypeProperty
range: boolean
domain: Subpopulations

mg_insertedOn
type: DatatypeProperty
range: dateTime
domain: Subpopulations

mg_updatedOn
type: DatatypeProperty
range: dateTime
domain: Subpopulations

resource
type: ObjectProperty
range: Resources
domain: Subpopulations
description: Resource this subpopulation is part of

name
type: DatatypeProperty
range: string
domain: Subpopulations
description: Subpopulation name, e.g. 'mothers in first trimester','newborns'

pid
type: DatatypeProperty
range: string
domain: Subpopulations
description: Persistent identifier for this subpopulation

description
type: DatatypeProperty
range: string
domain: Subpopulations
description: Subpopulation description

keywords
type: DatatypeProperty
range: string
domain: Subpopulations
description: Keywords to increase findability of this subpopulation. Try to use words that are not used in the description. Keywords are not displayed on the subpopulation page

number of participants
type: DatatypeProperty
range: nonNegativeInteger
domain: Subpopulations
description: Number of participants in this subpopulation

counts
type: ObjectProperty
range: Subpopulation counts
domain: Subpopulations
description: Total number of unique individuals per age(group), gender and year

inclusion start
type: DatatypeProperty
range: int
domain: Subpopulations
description: Year of first included participant

inclusion end
type: DatatypeProperty
range: int
domain: Subpopulations
description: Year of last included participant. Leave empty if data collection is ongoing

age groups
type: ObjectProperty
range: AgeGroups
domain: Subpopulations
description: Age groups within this subpopulation

age min
type: DatatypeProperty
range: nonNegativeInteger
domain: Subpopulations
description: Minimum age of participants within this subpopulation

age max
type: DatatypeProperty
range: nonNegativeInteger
domain: Subpopulations
description: Maximum age of participants within this subpopulation

main medical condition
type: ObjectProperty
range: Diseases
domain: Subpopulations
description: Disease groups within this subpopulation, based on ICD-10 and ORPHA code classifications

comorbidity
type: ObjectProperty
range: Diseases
domain: Subpopulations
description: Comorbidity within this subpopulation, based on ICD-10 classification

countries
type: ObjectProperty
range: Countries
domain: Subpopulations
description: Countries where data from this subpopulation largely originate from

regions
type: ObjectProperty
range: Regions
domain: Subpopulations
description: Geographical regions where data from this subpopulation largely originate from

inclusion criteria
type: ObjectProperty
range: InclusionExclusionCriteria
domain: Subpopulations
description: Inclusion criteria applied to this subpopulation

other inclusion criteria
type: DatatypeProperty
range: string
domain: Subpopulations
description: Other inclusion criteria applied to this subpopulation

exclusion criteria
type: ObjectProperty
range: InclusionExclusionCriteria
domain: Subpopulations
description: Exclusion criteria applied to this subpopulation

other exclusion criteria
type: DatatypeProperty
range: string
domain: Subpopulations
description: Other exclusion criteria applied to this subpopulation

contact point
type: ObjectProperty
range: Contacts
domain: Subpopulations
description: Contact point for this subpopulation. Value copied from Resources table

publisher
type: ObjectProperty
range: Organisations
domain: Subpopulations
description: Organisation that published this subpopulation. Value copied from Resources table

creator
type: ObjectProperty
range: Organisations
domain: Subpopulations
description: Organisation(s) that created this subpopulation. Value copied from Resources table

issued
type: DatatypeProperty
range: dateTime
domain: Subpopulations
description: When the data for this subpopulation was first published

modified
type: DatatypeProperty
range: dateTime
domain: Subpopulations
description: When the data for this subpopulation was last modified

theme
type: ObjectProperty
range: Themes
domain: Subpopulations
description: A main category of the subpopulation. A subpopulation can have multiple themes, for health data theme must at least take the value 'Health', which is set as a default

access rights
type: ObjectProperty
range: AccessRights
domain: Subpopulations
description: Information that indicates whether the resource is publicly accessible, has access restrictions or is not public. A default is set for non-public access, because most health datasets contain sensitive information and rules and licenses apply to get access

applicable legislation
type: ObjectProperty
range: Legislations
domain: Subpopulations
description: The legislation that mandates the creation or management of the subpopulation. For health datasets, the value must include the data governance act, which is set as a default. URI's to other legislations may be included

provenance statement
type: DatatypeProperty
range: string
domain: Subpopulations
description: A statement of any changes in ownership and custody of a resource since its creation that are significant for its authenticity, integrity, and interpretation

mg_draft
type: DatatypeProperty
range: boolean
domain: Version

mg_insertedOn
type: DatatypeProperty
range: dateTime
domain: Version

mg_updatedOn
type: DatatypeProperty
range: dateTime
domain: Version

mg_draft
type: DatatypeProperty
range: boolean
domain: Agents

mg_insertedOn
type: DatatypeProperty
range: dateTime
domain: Agents

mg_updatedOn
type: DatatypeProperty
range: dateTime
domain: Agents

resource
type: ObjectProperty
range: Resources
domain: Agents
description: Resource this Agent is associated with

id
type: DatatypeProperty
range: string
domain: Agents
description: Internal identifier. Ideally fill out acronym for an organisation (e.g. UMCG) and full name for a person (e.g. Ada Lovelace)"

type
type: ObjectProperty
range: AgentTypes
domain: Agents
description: Type of agent: person or organisation

name
type: DatatypeProperty
range: string
domain: Agents
description: Name of the individual

organisation
type: ObjectProperty
range: Organisations
domain: Agents
description: Organisation name from Research Organization Registry (ROR).

other organisation
type: DatatypeProperty
range: string
domain: Agents
description: If your organisation is not listed, please look up in ROR: https://ror.org/ and preferably provide ROR id, otherwise fill out your organisation name.

department
type: DatatypeProperty
range: string
domain: Agents
description: Name of department within the organisation

website
type: ObjectProperty
domain: Agents
description: A website representing this Agent

email
type: DatatypeProperty
range: anyURI
domain: Agents
description: E-mail address to contact this organisation or individual

logo
type: DatatypeProperty
range: anyURI
domain: Agents
description: Logo of the organisation

role
type: ObjectProperty
range: OrganisationRoles
domain: Agents
description: Type(s) of contribution or role in the resource

organisation name
type: DatatypeProperty
range: string
domain: Agents
description: Organisation name, copied value from ROR ontology for DCAT conform RDF generation

organisation pid
type: DatatypeProperty
range: string
domain: Agents
description: ROR id, copied value from ROR ontology for DCAT conform RDF generation

organisation website
type: ObjectProperty
domain: Agents
description: Organisation website, copied value from ROR ontology for DCAT conform RDF generation

mg_tableclass
type: DatatypeProperty
range: string
domain: Agents

mg_draft
type: DatatypeProperty
range: boolean
domain: Collection events

mg_insertedOn
type: DatatypeProperty
range: dateTime
domain: Collection events

mg_updatedOn
type: DatatypeProperty
range: dateTime
domain: Collection events

resource
type: ObjectProperty
range: Resources
domain: Collection events
description: Resource this collection event is part of

name
type: DatatypeProperty
range: string
domain: Collection events
description: Name of the collection event

pid
type: DatatypeProperty
range: string
domain: Collection events
description: Persistent identifier for this collection event

description
type: DatatypeProperty
range: string
domain: Collection events
description: Description of the collection event

subpopulations
type: ObjectProperty
range: Subpopulations
domain: Collection events
description: Subpopulations that are targetted by this collection event

keywords
type: DatatypeProperty
range: string
domain: Collection events
description: Keywords to increase findability of this collection event. Try to use words that are not used in the description. Keywords are not displayed on the collection event page

start date
type: DatatypeProperty
range: date
domain: Collection events
description: Start date of data collection

end date
type: DatatypeProperty
range: date
domain: Collection events
description: End date of data collection. Leave empty if collection is ongoing

age groups
type: ObjectProperty
range: AgeGroups
domain: Collection events
description: Age groups included in this data collection event

number of participants
type: DatatypeProperty
range: int
domain: Collection events
description: Number of participants sampled in this data collection event

areas of information
type: ObjectProperty
range: AreasOfInformationCohorts
domain: Collection events
description: Areas of information that were extracted in this data collection event

data categories
type: ObjectProperty
range: DataCategories
domain: Collection events
description: Methods of data collection used in this collection event

sample categories
type: ObjectProperty
range: SampleCategories
domain: Collection events
description: Samples that were collected in this collection event

standardized tools
type: ObjectProperty
range: StandardizedTools
domain: Collection events
description: Standardized tools, e.g. surveys, questionnaires, instruments used to collect data for this collection event

standardized tools other
type: DatatypeProperty
range: string
domain: Collection events
description: If 'other', please specify

core variables
type: DatatypeProperty
range: string
domain: Collection events
description: Name 10-20 relevant variables that were collected in this collection event

contact point
type: ObjectProperty
range: Contacts
domain: Collection events
description: Contact point for this collection event. Value copied from Resources table

publisher
type: ObjectProperty
range: Organisations
domain: Collection events
description: Organisation that published this collection event. Value copied from Resources table

creator
type: ObjectProperty
range: Organisations
domain: Collection events
description: Organisation(s) that created this collection event. Value copied from Resources table

issued
type: DatatypeProperty
range: dateTime
domain: Collection events
description: When the data for this collection event was first published

modified
type: DatatypeProperty
range: dateTime
domain: Collection events
description: When the data for this collection event was last modified

theme
type: ObjectProperty
range: Themes
domain: Collection events
description: A main category of the collection event. A collection event can have multiple themes, for health data theme must at least take the value 'Health', which is set as a default

access rights
type: ObjectProperty
range: AccessRights
domain: Collection events
description: Information that indicates whether the resource is publicly accessible, has access restrictions or is not public. A default is set for non-public access, because most health datasets contain sensitive information and rules and licenses apply to get access

applicable legislation
type: ObjectProperty
range: Legislations
domain: Collection events
description: The legislation that mandates the creation or management of the collection event. For health datasets, the value must include the data governance act, which is set as a default. URI's to other legislations may be included

provenance statement
type: DatatypeProperty
range: string
domain: Collection events
description: A statement of any changes in ownership and custody of a resource since its creation that are significant for its authenticity, integrity, and interpretation

mg_draft
type: DatatypeProperty
range: boolean
domain: Contacts

mg_insertedOn
type: DatatypeProperty
range: dateTime
domain: Contacts

mg_updatedOn
type: DatatypeProperty
range: dateTime
domain: Contacts

resource
type: ObjectProperty
range: Resources
domain: Contacts
description: Resource the contact is affiliated with

role
type: ObjectProperty
range: ContributionTypes
domain: Contacts
description: Type(s) of contribution or role in the resource

role description
type: DatatypeProperty
range: string
domain: Contacts
description: Description of the role

first name
type: DatatypeProperty
range: string
domain: Contacts
description: First name of the contact person

last name
type: DatatypeProperty
range: string
domain: Contacts
description: Last name of the contact person

display name
type: DatatypeProperty
range: string
domain: Contacts
description: Display name of the contact person

prefix
type: DatatypeProperty
range: string
domain: Contacts
description: Surname prefix, if applicable

initials
type: DatatypeProperty
range: string
domain: Contacts
description: Initials of the contact person

title
type: ObjectProperty
range: Titles
domain: Contacts
description: Title of the contact person

organisation
type: ObjectProperty
range: Organisations
domain: Contacts
description: Affiliated organisation of the contact person

email
type: DatatypeProperty
range: anyURI
domain: Contacts
description: Contact's email address

orcid
type: DatatypeProperty
range: string
domain: Contacts
description: Orcid of the contact person

homepage
type: ObjectProperty
domain: Contacts
description: Link to contact's homepage

photo
type: DatatypeProperty
range: anyURI
domain: Contacts
description: Contact's photograph

expertise
type: DatatypeProperty
range: string
domain: Contacts
description: Description of contact's expertise

mg_draft
type: DatatypeProperty
range: boolean
domain: Datasets

mg_insertedOn
type: DatatypeProperty
range: dateTime
domain: Datasets

mg_updatedOn
type: DatatypeProperty
range: dateTime
domain: Datasets

resource
type: ObjectProperty
range: Resources
domain: Datasets
description: Resource of which the dataset is part

name
type: DatatypeProperty
range: string
domain: Datasets
description: Unique dataset name in the model

label
type: DatatypeProperty
range: string
domain: Datasets
description: Short human readable description

dataset type
type: ObjectProperty
range: DatasetTypes
domain: Datasets
description: Defines the type of dataset, e.g. genomic

unit of observation
type: ObjectProperty
range: ObservationTargets
domain: Datasets
description: Defines what each record in this table describes

keywords
type: ObjectProperty
range: Keywords
domain: Datasets
description: Enables grouping of table list by topic and to display tables in a tree

description
type: DatatypeProperty
range: string
domain: Datasets
description: Description of the role/function of this table

number of rows
type: DatatypeProperty
range: int
domain: Datasets
description: Count of the number of records in this table

mapped to
type: ObjectProperty
range: Dataset mappings
domain: Datasets
description: Common dataset models this dataset has been mapped into

mapped from
type: ObjectProperty
range: Dataset mappings
domain: Datasets
description: Source datasets that have been mapped to this harmonised dataset

since version
type: DatatypeProperty
range: string
domain: Datasets
description: When this dataset was introduced, if applicable

until version
type: DatatypeProperty
range: string
domain: Datasets
description: When this dataset was removed, if applicable

mg_draft
type: DatatypeProperty
range: boolean
domain: External identifiers

mg_insertedOn
type: DatatypeProperty
range: dateTime
domain: External identifiers

mg_updatedOn
type: DatatypeProperty
range: dateTime
domain: External identifiers

resource
type: ObjectProperty
range: Resources
domain: External identifiers
description: Resource that this external identifier belongs to

identifier
type: DatatypeProperty
range: string
domain: External identifiers
description: External identifier

external identifier type
type: ObjectProperty
range: ExternalIdentifierTypes
domain: External identifiers
description: External identifier type

external identifier type other
type: DatatypeProperty
range: string
domain: External identifiers
description: If 'other', enter external identifier type

mg_draft
type: DatatypeProperty
range: boolean
domain: Linkages

mg_insertedOn
type: DatatypeProperty
range: dateTime
domain: Linkages

mg_updatedOn
type: DatatypeProperty
range: dateTime
domain: Linkages

resource
type: ObjectProperty
range: Resources
domain: Linkages
description: Main resource for this linkage

linked resource
type: ObjectProperty
range: Resources
domain: Linkages
description: Linked resource

linkage strategy
type: ObjectProperty
range: LinkageStrategies
domain: Linkages
description: The linkage method that was used to link resources

linkage variable
type: DatatypeProperty
range: string
domain: Linkages
description: If a single variable (or linkage key) is used to link resources, provide a name and description of the variable

linkage variable unique
type: DatatypeProperty
range: boolean
domain: Linkages
description: If a single variable is used to link resources, is the variable a unique identifier?

linkage completeness
type: DatatypeProperty
range: string
domain: Linkages
description: Provide a high-level description of the completeness of linkages that are currently available between resources (max 100 words)

pre linked
type: DatatypeProperty
range: boolean
domain: Linkages
description: Does the data source constitute of linked data sources?

is lead organisation
type: DatatypeProperty
range: boolean
domain: Organisations
description: Whether the organisation is the lead organisation of this resource

mg_draft
type: DatatypeProperty
range: boolean
domain: Resource counts

mg_insertedOn
type: DatatypeProperty
range: dateTime
domain: Resource counts

mg_updatedOn
type: DatatypeProperty
range: dateTime
domain: Resource counts

resource
type: ObjectProperty
range: Resources
domain: Resource counts
description: Resource id

age group
type: ObjectProperty
range: AgeGroups
domain: Resource counts
description: Select the relevant age group for this quantitative information

population size
type: DatatypeProperty
range: int
domain: Resource counts
description: Total number of unique individuals with records captured in the data source (most recent count). In the catalogue, this will accommodate counts per year

active size
type: DatatypeProperty
range: int
domain: Resource counts
description: Number of unique, active, or currently registered individuals with records captured in the data source (most recent count). In the catalogue, this will accommodate counts per year

no individuals with samples
type: DatatypeProperty
range: int
domain: Resource counts
description: Number of unique individuals with records of biological samples (e.g., blood, urine) (most recent count). In the catalogue, this will accommodate counts per year

mean observation years
type: DatatypeProperty
range: int
domain: Resource counts
description: Median years for which unique individuals with records captured in the data source are observable (most recent count)

mean years active
type: DatatypeProperty
range: int
domain: Resource counts
description: Median time for which unique individuals with records captured in the data source are observable (most recent count)

median age
type: DatatypeProperty
range: int
domain: Resource counts
description: Median age of individuals within data source

proportion female
type: DatatypeProperty
range: int
domain: Resource counts
description: Proportion of females in the data source

mg_draft
type: DatatypeProperty
range: boolean
domain: Subpopulation counts

mg_insertedOn
type: DatatypeProperty
range: dateTime
domain: Subpopulation counts

mg_updatedOn
type: DatatypeProperty
range: dateTime
domain: Subpopulation counts

resource
type: ObjectProperty
range: Resources
domain: Subpopulation counts
description: Resource id

subpopulation
type: ObjectProperty
range: Subpopulations
domain: Subpopulation counts
description: Subpopulations for these counts

age group
type: ObjectProperty
range: AgeGroups
domain: Subpopulation counts
description: Select the age group for these counts

N total
type: DatatypeProperty
range: int
domain: Subpopulation counts
description: Total number

N female
type: DatatypeProperty
range: int
domain: Subpopulation counts
description: Number of females

N male
type: DatatypeProperty
range: int
domain: Subpopulation counts
description: Number of males

mg_draft
type: DatatypeProperty
range: boolean
domain: Variables

mg_insertedOn
type: DatatypeProperty
range: dateTime
domain: Variables

mg_updatedOn
type: DatatypeProperty
range: dateTime
domain: Variables

resource
type: ObjectProperty
range: Resources
domain: Variables
description: Resource that this variable is part of

dataset
type: ObjectProperty
range: Datasets
domain: Variables
description: Dataset that this variable is part of

name
type: DatatypeProperty
range: string
domain: Variables
description: Name of the variable, unique within a dataset

useExternalDefinition
type: ObjectProperty
range: Variables
domain: Variables
description: Refer to variable definition in other datasets

label
type: DatatypeProperty
range: string
domain: Variables
description: Human readable name, if applicable

description
type: DatatypeProperty
range: string
domain: Variables
description: Description of the variable

collection event
type: ObjectProperty
range: Collection events
domain: Variables
description: In case of protocolised data collection this defines the moment(s) in time this variable is collected on

format
type: ObjectProperty
range: Formats
domain: Variables
description: Data type, e.g. string, integer, decimal, date, datetime, etc.

unit
type: ObjectProperty
range: Units
domain: Variables
description: In case of a continuous variable, the unit that the variable values are expressed in

since version
type: DatatypeProperty
range: string
domain: Variables
description: When this variable was introduced

until version
type: DatatypeProperty
range: string
domain: Variables
description: When this variable was removed, if applicable

reused in resources
type: ObjectProperty
range: Reused variables
domain: Variables
description: Listing of variables from other resources that are reused by this resource

repeat unit
type: ObjectProperty
range: VariableRepeatUnits
domain: Variables
description: The repeat unit, in case the variable was repeatedly collected over time, e.g. month or week

repeat min
type: DatatypeProperty
range: int
domain: Variables
description: The first repeat unit

repeat max
type: DatatypeProperty
range: int
domain: Variables
description: The last repeat unit

example values
type: DatatypeProperty
range: string
domain: Variables
description: Example values for this variable

permitted values
type: ObjectProperty
range: Variable values
domain: Variables
description: Listing of variable values, filled out in Variable values table

keywords
type: ObjectProperty
range: Keywords
domain: Variables
description: Keywords that will make the variable easier to find

generated_keywords
type: ObjectProperty
range: Keywords
domain: Variables
description: LLM generated keywords, generated based on variable name, label and description

vocabularies
type: ObjectProperty
range: Vocabularies
domain: Variables
description: Vocabularies used to express the values of this variable

notes
type: DatatypeProperty
range: string
domain: Variables
description: Any other information on this variable

mappings
type: ObjectProperty
range: Variable mappings
domain: Variables
description: Listing of harmonised variables this variable was mapped to, filled out in Variable mappings table

type
type: ObjectProperty
range: ResourceTypes
domain: Collections
description: Type of resource, e.g. registry, cohort, biobank

cohort type
type: ObjectProperty
range: CohortStudyTypes
domain: Collections
description: Type of cohort

clinical study type
type: ObjectProperty
range: ClinicalStudyTypes
domain: Collections
description: Type of clinical study

registry or health record type
type: ObjectProperty
range: DatasourceTypes
domain: Collections
description: Type of registry or health record

keywords
type: DatatypeProperty
range: string
domain: Collections
description: Keywords to increase findability of this resource. Try to use words that are not used in the description. Keywords are not displayed on the resource page

time span description
type: DatatypeProperty
range: string
domain: Collections
description: Description of time span

status
type: ObjectProperty
range: StudyStatus
domain: Collections
description: Status of the study

design and structure
type: DatatypeProperty
range: string
domain: Collections
description: Structure of the resource

design
type: ObjectProperty
range: CohortDesigns
domain: Collections
description: The study design of this cohort, i.e. cross-sectional or longitudinal

design description
type: DatatypeProperty
range: string
domain: Collections
description: Short description of the study design of this resource, if applicable

design schematic
type: DatatypeProperty
range: anyURI
domain: Collections
description: A schematic depiction of the study design of this resource

data collection type
type: ObjectProperty
range: CohortCollectionTypes
domain: Collections
description: Retrospective or prospective data collection

data collection description
type: DatatypeProperty
range: string
domain: Collections
description: Describe the process of collection and recording of data

reason sustained
type: DatatypeProperty
range: string
domain: Collections
description: Description of the reason why the data bank is sustained by the organisation (e.g. for surveillance, clinical purposes, financial or administrative purposes, research purposes)

record trigger
type: DatatypeProperty
range: string
domain: Collections
description: What triggers the creation of a record in the data bank? e.g. planned collection events, hospital discharge, specialist encounter, dispensation of a medicinal product, recording of a congenital anomaly

unit of observation
type: DatatypeProperty
range: string
domain: Collections
description: Based on the record trigger or promt, what is the unit(s) of observation of a record (e.g. person, prescription)?

subpopulations
type: ObjectProperty
range: Subpopulations
domain: Collections
description: List of cohorts or subpopulations defined in this resource, if applicable

collection events
type: ObjectProperty
range: Collection events
domain: Collections
description: List of data/sample collection events defined for this collection, if applicable

part of networks
type: ObjectProperty
range: Networks
domain: Collections
description: List of other collections included in this resource

population
type: DatatypeProperty
range: string
domain: Collections
description: Description of the population that is sampled in this resource

number of participants
type: DatatypeProperty
range: nonNegativeInteger
domain: Collections
description: Total number of individuals for which data is collected

number of participants with samples
type: DatatypeProperty
range: nonNegativeInteger
domain: Collections
description: Number of individuals for which samples are collected

underlying population
type: DatatypeProperty
range: string
domain: Collections
description: Provide a summary description of the underlying population from which participants are sampled

population of interest
type: ObjectProperty
range: PopulationOfInterest
domain: Collections
description: Select population of interest

population of interest other
type: DatatypeProperty
range: string
domain: Collections
description: If population of interest is 'Other', please specify which other population has been studied

regions
type: ObjectProperty
range: Regions
domain: Collections
description: Geographical regions where data/samples from this resource largely originate from

population age groups
type: ObjectProperty
range: AgeGroups
domain: Collections
description: Which population age groups are captured in this resource? Select all that are relevant

age min
type: DatatypeProperty
range: nonNegativeInteger
domain: Collections
description: Minimum age of participants within this resource

age max
type: DatatypeProperty
range: nonNegativeInteger
domain: Collections
description: Maximum age of participants within this resource

inclusion criteria
type: ObjectProperty
range: InclusionExclusionCriteria
domain: Collections
description: Inclusion criteria applied to the participants of this resource

other inclusion criteria
type: DatatypeProperty
range: string
domain: Collections
description: Other inclusion criteria applied to the participants of this resource

exclusion criteria
type: ObjectProperty
range: InclusionExclusionCriteria
domain: Collections
description: Exclusion criteria applied to the participants of this resource

other exclusion criteria
type: DatatypeProperty
range: string
domain: Collections
description: Other exclusion criteria applied to the participants of this resource

population entry
type: ObjectProperty
range: PopulationEntry
domain: Collections
description: Select the possible causes / events that trigger the registration of a person in the data source

population entry other
type: DatatypeProperty
range: string
domain: Collections
description: If other, specify the causes of entry to the underlying population

population exit
type: ObjectProperty
range: PopulationExit
domain: Collections
description: Select the possible causes / events that trigger the de-registration of a person in the data source

population exit other
type: DatatypeProperty
range: string
domain: Collections
description: If other, specify the causes of exit from the underlying population

population disease
type: ObjectProperty
range: Diseases
domain: Collections
description: Is information on a specific disease subpopulation collected (e.g. as in a disease-specific registry or cohort)?

population oncology topology
type: ObjectProperty
range: ICDOTopologies
domain: Collections
description: Is information on specific cancer subtype(s) collected? If yes, select topology specifications

population oncology morphology
type: ObjectProperty
range: ICDOMorphologies
domain: Collections
description: Is information on specific cancer subtype(s) collected? If yes, select morphology specifications

population coverage
type: DatatypeProperty
range: string
domain: Collections
description: Estimated percentage of the population covered by the data source in the catchment area. Please describe the denominator

population not covered
type: DatatypeProperty
range: string
domain: Collections
description: Description of the population covered by the data source in the catchment area whose data are not collected, where applicable (e.g. people who are registered only for private care)

available data and samples
type: DatatypeProperty
range: string
domain: Collections
description: Data model and contents

areas of information
type: ObjectProperty
range: AreasOfInformationCohorts
domain: Collections
description: Areas of information that were collected

areas of information rwd
type: ObjectProperty
range: AreasOfInformationDs
domain: Collections
description: Areas of information that were collected

quality of life other
type: DatatypeProperty
range: string
domain: Collections
description: If 'other', specify additional quality of life measures

cause of death code other
type: DatatypeProperty
range: string
domain: Collections
description: If 'other', what cause of death vocabulary is used?

indication vocabulary other
type: DatatypeProperty
range: string
domain: Collections
description: If 'other', what indication for use vocabulary is used?

genetic data vocabulary other
type: DatatypeProperty
range: string
domain: Collections
description: If 'other', what genetic data vocabulary is used?

care setting other
type: DatatypeProperty
range: string
domain: Collections
description: If 'other', description of the setting of care

medicinal product vocabulary other
type: DatatypeProperty
range: string
domain: Collections
description: If 'other', description of the medicinal product vocabulary

prescriptions vocabulary other
type: DatatypeProperty
range: string
domain: Collections
description: If 'other', what prescriptions vocabulary is used?

dispensings vocabulary other
type: DatatypeProperty
range: string
domain: Collections
description: If 'other', what dispensings vocabulary is used?

procedures vocabulary other
type: DatatypeProperty
range: string
domain: Collections
description: If 'other', what procedures vocabulary is used?

biomarker data vocabulary other
type: DatatypeProperty
range: string
domain: Collections
description: If 'other', what biomarker data vocabulary is used?

diagnosis medical event vocabulary other
type: DatatypeProperty
range: string
domain: Collections
description: If 'other', what diagnosis medical event vocabulary is used?

data dictionary available
type: DatatypeProperty
range: boolean
domain: Collections
description: Are a data dictionary and a data model available?

biospecimen collected
type: ObjectProperty
range: Biospecimens
domain: Collections
description: If the data bank contains biospecimens, what types of specimen

languages
type: ObjectProperty
range: Languages
domain: Collections
description: Languages that the records are recorded in (ISO 639)

multiple entries
type: DatatypeProperty
range: boolean
domain: Collections
description: Can there be multiple entries for a single person in the data bank?

linkage
type: DatatypeProperty
range: string
domain: Collections
description: Data linkage

has identifier
type: DatatypeProperty
range: boolean
domain: Collections
description: Is there a unique identifier for a person in the data bank?

identifier description
type: DatatypeProperty
range: string
domain: Collections
description: Describe the variable that is used as a unique identifier for a person in the data bank. If the unique identifier is not at level of a person (for example hospital encounter), describe how this is translated to an individual level

prelinked
type: DatatypeProperty
range: boolean
domain: Collections
description: Is the data from this data source linked to other data sources?

linkage options
type: DatatypeProperty
range: string
domain: Collections
description: Linkage options with additional data resources that are available for this resource

linkage possibility
type: DatatypeProperty
range: boolean
domain: Collections
description: Can this data source be linked to other data sources?

access conditions
type: DatatypeProperty
range: string
domain: Collections
description: Access and validation information

informed consent type
type: ObjectProperty
range: InformedConsentTypes
domain: Collections
description: What type of informed consent was given for data resource?

informed consent required
type: ObjectProperty
range: InformedConsentRequired
domain: Collections
description: Is informed consent required for use of the data for research purposes?

informed consent other
type: DatatypeProperty
range: string
domain: Collections
description: If 'other', describe the conditions when informed consent is required

access rights
type: ObjectProperty
range: AccessRights
domain: Collections
description: Information that indicates whether the resource is publicly accessible, has access restrictions or is not public. A default is set for non-public access, because most health datasets contain sensitive information and rules and licenses apply to get access.

data access conditions
type: ObjectProperty
range: DataAccessConditions
domain: Collections
description: Codes defining data access terms and conditions

data use conditions
type: ObjectProperty
range: DataUseConditions
domain: Collections
description: Codes defining data use terms and conditions

data access conditions description
type: DatatypeProperty
range: string
domain: Collections
description: Description of data access terms and use conditions

data access fee
type: DatatypeProperty
range: boolean
domain: Collections
description: Does a fee apply to gain access to data of this resource?

access identifiable data
type: DatatypeProperty
range: string
domain: Collections
description: Can identifiable data be accessed in the data bank (including patient/practitioner name/practice name)?

access identifiable data route
type: DatatypeProperty
range: string
domain: Collections
description: If yes above, what is the route to access or process this information? What permission is required?

access subject details
type: DatatypeProperty
range: boolean
domain: Collections
description: Can individual patients/practitioners/practices be contacted in the data bank?

access subject details route
type: DatatypeProperty
range: string
domain: Collections
description: If yes to the above, what is the route to access or process this information? What permission is required?

access third party
type: DatatypeProperty
range: boolean
domain: Collections
description: Can (an extract of) the data bank be accessed with permission by a third party?

access third party conditions
type: DatatypeProperty
range: string
domain: Collections
description: If above is 'yes', describe the conditions under which third-party access may be granted

access non EU
type: DatatypeProperty
range: boolean
domain: Collections
description: Can (an extract of) the data bank be accessed with permission by a non-EU/EEA institution?

access non EU conditions
type: DatatypeProperty
range: string
domain: Collections
description: If yes to the above, describe the conditions under which non-EU/EEA access may be granted

biospecimen access
type: DatatypeProperty
range: boolean
domain: Collections
description: If the data bank contains biospecimens (e.g. tissue samples), can these be retrieved?

biospecimen access conditions
type: DatatypeProperty
range: string
domain: Collections
description: If yes to the above, describe the conditions under which permission to retrieve biospecimens may be granted

governance details
type: DatatypeProperty
range: string
domain: Collections
description: If available, provide a link to documents or webpages that describe the overall governance of the data source bank (governing data access or utilisation for research purposes by existing DAPs)

approval for publication
type: DatatypeProperty
range: boolean
domain: Collections
description: Is an approval needed to publish the results of a study using the data

updates
type: DatatypeProperty
range: string
domain: Collections
description: Information on the regularity of updates and time lags

release type
type: ObjectProperty
range: ReleaseTypes
domain: Collections
description: Select whether this resource is a closed dataset or whether new data is released continuously or at a termly basis

release description
type: DatatypeProperty
range: string
domain: Collections
description: Description of the release cycle of this resource

number of records
type: DatatypeProperty
range: int
domain: Collections
description: Total number of unique records captured in the data bank (most recent count)

release frequency
type: DatatypeProperty
range: int
domain: Collections
description: Refreshing rate (in months)

refresh time
type: DatatypeProperty
range: int
domain: Collections
description: Average number of days between refresh of data bank with new records

lag time
type: DatatypeProperty
range: int
domain: Collections
description: How many days is the lag time after refresh before a record can be extracted? (e.g. a lag time may occur if the originator conducts quality checks)

refresh period
type: ObjectProperty
range: RefreshPeriods
domain: Collections
description: If data are refreshed on fixed dates (e.g. every June and December), when are the refreshes scheduled? Select all that apply from the following:

date last refresh
type: DatatypeProperty
range: date
domain: Collections
description: Date of last update/refresh

preservation
type: DatatypeProperty
range: boolean
domain: Collections
description: Are records preserved in the data bank indefinitely?

preservation duration
type: DatatypeProperty
range: int
domain: Collections
description: If 'no' to the above, for how long (in years) are records preserved in the data bank?

quality
type: DatatypeProperty
range: string
domain: Collections
description: List of relevant studies conducted using the data bank

standard operating procedures
type: DatatypeProperty
range: boolean
domain: Collections
description: Is there a standard operating procedure document that defines the processes and procedures for data capture and management?

qualification
type: DatatypeProperty
range: boolean
domain: Collections
description: Has the data source successfully undergone a formal qualification process (e.g. from the EMA, ISO or other certifications)?

qualifications description
type: DatatypeProperty
range: string
domain: Collections
description: Has the data source successfully undergone a qualification process (e.g. from the EMA)? If yes, describe the qualification(s) granted

audit possible
type: DatatypeProperty
range: boolean
domain: Collections
description: Are external parties allowed to audit the data? For example, is it possible for an external party to audit the quality or validity of the data source?

completeness
type: DatatypeProperty
range: string
domain: Collections
description: Describe the completeness of the data bank (e.g. variables with more or fewer missing values)

completeness over time
type: DatatypeProperty
range: string
domain: Collections
description: Describe any changes in completeness of the data bank (e.g. variables with more or fewer missing values) that have occurred over time

completeness results
type: DatatypeProperty
range: string
domain: Collections
description: What methods or processes are applied to check completeness of the data bank?

quality description
type: DatatypeProperty
range: string
domain: Collections
description: Describe the quality of the data bank (e.g. variables with more or fewer missing values)

quality over time
type: DatatypeProperty
range: string
domain: Collections
description: Describe any changes in quality of the data bank that have occurred over time

access for validation
type: DatatypeProperty
range: boolean
domain: Collections
description: Can validity of the data in the data bank be verified, e.g. by review of origin medical charts?

quality validation frequency
type: DatatypeProperty
range: string
domain: Collections
description: How often are data quality checks and validation steps conducted on the data bank?

quality validation methods
type: DatatypeProperty
range: string
domain: Collections
description: What methods or processes are applied for data quality checks and validation steps conducted on the data bank?

correction methods
type: DatatypeProperty
range: string
domain: Collections
description: What methods or processes are applied to correct illogical values in the data bank?

quality validation results
type: DatatypeProperty
range: string
domain: Collections
description: If available, provide a link to a publication of the data quality check and validation results

ETL standard vocabularies
type: ObjectProperty
range: Vocabularies
domain: Collections
description: Are data mapped to standardised vocabularies during ETL to the CDM? If yes, what vocabularies are used for events, such as diagnoses?

ETL standard vocabularies other
type: DatatypeProperty
range: string
domain: Collections
description: If other, what other vocabularies are used?

provenance statement
type: DatatypeProperty
range: string
domain: Collections
description: A statement of any changes in ownership and custody of a resource since its creation that are significant for its authenticity, integrity, and interpretation

theme
type: ObjectProperty
range: Themes
domain: Collections
description: A main category of the resource. A resource can have multiple themes, for health data theme must at least take the value 'Health', which is set as a default

study details
type: DatatypeProperty
range: string
domain: Collections
description: List of relevant collaborations

collection start planned
type: DatatypeProperty
range: date
domain: Collections
description: When was the data collection planned to start?

collection start actual
type: DatatypeProperty
range: date
domain: Collections
description: When was the data collection actually start?

analysis start planned
type: DatatypeProperty
range: date
domain: Collections
description: When was the data analysis planned to start?

analysis start actual
type: DatatypeProperty
range: date
domain: Collections
description: When did the data analysis actually start?

data sources
type: ObjectProperty
range: Resources
domain: Collections
description: Data sources that provided data into this study

data extraction date
type: DatatypeProperty
range: date
domain: Collections
description: Date on which the study data was extracted

study methods
type: DatatypeProperty
range: string
domain: Collections
description: Methodological aspects

analysis plan
type: DatatypeProperty
range: string
domain: Collections
description: A brief summary of the analysis method (e.g. risk estimation, measures of risk, internal/external validity)

objectives
type: DatatypeProperty
range: string
domain: Collections
description: A short description of the study objective

results
type: DatatypeProperty
range: string
domain: Collections
description: A brief summary of the results of the study on study completion (e.g. from abstract)

mg_draft
type: DatatypeProperty
range: boolean
domain: Documentation

mg_insertedOn
type: DatatypeProperty
range: dateTime
domain: Documentation

mg_updatedOn
type: DatatypeProperty
range: dateTime
domain: Documentation

resource
type: ObjectProperty
range: Resources
domain: Documentation
description: The resource this documentation is for

name
type: DatatypeProperty
range: string
domain: Documentation
description: Document name

type
type: ObjectProperty
range: DocumentTypes
domain: Documentation
description: Type of documentation

description
type: DatatypeProperty
range: string
domain: Documentation
description: Description of the document

url
type: ObjectProperty
domain: Documentation
description: Hyperlink to the source of the documentation

file
type: DatatypeProperty
range: anyURI
domain: Documentation
description: Optional file attachment containing the documentation

network type
type: ObjectProperty
range: NetworkTypes
domain: Networks
description: Type of network

data resources
type: ObjectProperty
range: Collections
domain: Networks
description: List of other data collections included in this network, e.g. cohorts, biobanks or real world data sources. Do not list other networks or catalogues here

child networks
type: ObjectProperty
range: Networks
domain: Networks
description: List of networks, consortia or catalogues included in this network

parent networks
type: ObjectProperty
range: Networks
domain: Networks
description: The consortia or networks that this resource is part of

mg_draft
type: DatatypeProperty
range: boolean
domain: Resource mappings

mg_insertedOn
type: DatatypeProperty
range: dateTime
domain: Resource mappings

mg_updatedOn
type: DatatypeProperty
range: dateTime
domain: Resource mappings

source
type: ObjectProperty
range: Resources
domain: Resource mappings
description: Data resource that is being mapped to a (common) data model

source version
type: DatatypeProperty
range: string
domain: Resource mappings
description: Version of the resource that is being mapped

target
type: ObjectProperty
range: Resources
domain: Resource mappings
description: Model being mapped to

target version
type: DatatypeProperty
range: string
domain: Resource mappings
description: Version of the model being mapped to

cdms other
type: DatatypeProperty
range: string
domain: Resource mappings
description: If cdm is not under targets, which cdm was mapped to? (default = not applicable)

mapping status
type: ObjectProperty
range: MappingStatus
domain: Resource mappings
description: Mapping status

ETL frequency
type: DatatypeProperty
range: int
domain: Resource mappings
description: The frequency of the ETL process, in months

ETL specification url
type: ObjectProperty
domain: Resource mappings
description: Link to ETL specification documentation

ETL specification document
type: DatatypeProperty
range: anyURI
domain: Resource mappings
description: Documentation concerning ETL details

mg_draft
type: DatatypeProperty
range: boolean
domain: Variable mappings

mg_insertedOn
type: DatatypeProperty
range: dateTime
domain: Variable mappings

mg_updatedOn
type: DatatypeProperty
range: dateTime
domain: Variable mappings

source
type: ObjectProperty
range: Resources
domain: Variable mappings
description: Id of the resource that contains the source variable(s)

source dataset
type: ObjectProperty
range: Datasets
domain: Variable mappings
description: Name of the dataset that contains the source variable(s)

source variables
type: ObjectProperty
range: Variables
domain: Variable mappings
description: Optional, source variable that was mapped from. You may also indicate that a mapping to a target variable was not done and leave this field empty (match = not available)

source variables other datasets
type: ObjectProperty
range: Variables
domain: Variable mappings
description: Optional, variables from other source datasets. Initially one may only define mapping between releases

target
type: ObjectProperty
range: Resources
domain: Variable mappings
description: Id of the resource that contains the target variable

target dataset
type: ObjectProperty
range: Datasets
domain: Variable mappings
description: Name of the dataset that contains the target variable

target variable
type: ObjectProperty
range: Variables
domain: Variable mappings
description: Target variable that was mapped to

repeats
type: DatatypeProperty
range: string
domain: Variable mappings
description: In case of mapping to a repeated variable, specify which repeats were mapped to

match
type: ObjectProperty
range: StatusDetails
domain: Variable mappings
description: Harmonisation match, i.e., complete, partial, na

description
type: DatatypeProperty
range: string
domain: Variable mappings
description: Human readible description of the mapping

syntax
type: DatatypeProperty
range: string
domain: Variable mappings
description: Formal definition of the mapping, ideally in executable code

comments
type: DatatypeProperty
range: string
domain: Variable mappings
description: Additional notes or comments

fdp endpoint
type: ObjectProperty
range: Endpoint
domain: Catalogues
description: FDP endpoint associated with the catalogue

ldp membership relation
type: ObjectProperty
domain: Catalogues
description: LDP membership relation

catalogue type
type: ObjectProperty
range: CatalogueTypes
domain: Catalogues
description: Type of catalogue

main catalogue
type: DatatypeProperty
range: boolean
domain: Catalogues
description: Is this the main catalogue of this catalogue server?

conforms to
type: ObjectProperty
domain: Catalogues
description: The specification of the catalog metadata schema

has member relation
type: ObjectProperty
domain: Catalogues
description: This relation points to the URI of the custom relation/predicate used to relate the FAIR Data Point with its member catalogs. The object of this property MUST be fdp-o:metadataCatalog.

mg_draft
type: DatatypeProperty
range: boolean
domain: Internal identifiers

mg_insertedOn
type: DatatypeProperty
range: dateTime
domain: Internal identifiers

mg_updatedOn
type: DatatypeProperty
range: dateTime
domain: Internal identifiers

resource
type: ObjectProperty
range: Resources
domain: Internal identifiers
description: Resource that this internal identifier belongs to

identifier
type: DatatypeProperty
range: string
domain: Internal identifiers
description: Internal identifier

internal identifier type
type: ObjectProperty
range: InternalIdentifierTypes
domain: Internal identifiers
description: Internal identifier type

internal identifier type other
type: DatatypeProperty
range: string
domain: Internal identifiers
description: If 'other', enter internal identifier type

mg_draft
type: DatatypeProperty
range: boolean
domain: Reused variables

mg_insertedOn
type: DatatypeProperty
range: dateTime
domain: Reused variables

mg_updatedOn
type: DatatypeProperty
range: dateTime
domain: Reused variables

resource
type: ObjectProperty
range: Resources
domain: Reused variables
description: Resource reusing the variable

variable
type: ObjectProperty
range: Variables
domain: Reused variables
description: Variable from another resource that is reused

mg_draft
type: DatatypeProperty
range: boolean
domain: Dataset mappings

mg_insertedOn
type: DatatypeProperty
range: dateTime
domain: Dataset mappings

mg_updatedOn
type: DatatypeProperty
range: dateTime
domain: Dataset mappings

source
type: ObjectProperty
range: Resources
domain: Dataset mappings
description: Id of the resource being mapped from

source dataset
type: ObjectProperty
range: Datasets
domain: Dataset mappings
description: Name of the dataset being mapped from

target
type: ObjectProperty
range: Resources
domain: Dataset mappings
description: Network being mapped to

target dataset
type: ObjectProperty
range: Datasets
domain: Dataset mappings
description: Name of the dataset being mapped to, or harmonised with

order
type: DatatypeProperty
range: int
domain: Dataset mappings
description: Order in which table ETLs should be executed for this source-target combination

description
type: DatatypeProperty
range: string
domain: Dataset mappings
description: Human readible description of the mapping

syntax
type: DatatypeProperty
range: string
domain: Dataset mappings
description: Formal definition of the mapping, ideally in executable code

mg_draft
type: DatatypeProperty
range: boolean
domain: Variable values

mg_insertedOn
type: DatatypeProperty
range: dateTime
domain: Variable values

mg_updatedOn
type: DatatypeProperty
range: dateTime
domain: Variable values

resource
type: ObjectProperty
range: Resources
domain: Variable values
description: Resource the variable belongs to

dataset
type: ObjectProperty
range: Datasets
domain: Variable values
description: Dataset the variable belongs to

variable
type: ObjectProperty
range: Variables
domain: Variable values
description: Variable name

value
type: DatatypeProperty
range: string
domain: Variable values
description: Variable value, e.g. '1'

label
type: DatatypeProperty
range: string
domain: Variable values
description: Variable label, e.g. 'Yes'

order
type: DatatypeProperty
range: int
domain: Variable values
description: Order that the variable values should be displayed in

is missing
type: DatatypeProperty
range: boolean
domain: Variable values
description: Whether this variable value indicates that data is missing, e.g. '-1' for 'NA'

ontology term URI
type: DatatypeProperty
range: string
domain: Variable values
description: Reference to ontology term that defines this categorical value

since version
type: DatatypeProperty
range: string
domain: Variable values
description: When this variable value was introduced, if applicable

until version
type: DatatypeProperty
range: string
domain: Variable values
description: When this variable value was removed, if applicable

mg_draft
type: DatatypeProperty
range: boolean
domain: Publications

mg_insertedOn
type: DatatypeProperty
range: dateTime
domain: Publications

mg_updatedOn
type: DatatypeProperty
range: dateTime
domain: Publications

resource
type: ObjectProperty
range: Resources
domain: Publications
description: Resource that this publication is part of

doi
type: ObjectProperty
domain: Publications
description: Digital object identifier

title
type: DatatypeProperty
range: string
domain: Publications
description: Publication title

is design publication
type: DatatypeProperty
range: boolean
domain: Publications
description: Whether this publication is a marker or design publication

reference
type: DatatypeProperty
range: string
domain: Publications
description: Formatted reference string (we aim to have this autogenerated)

main_fdp
type: Endpoint
type: Observation
type: Service
endpoint URL: catalogue_rdf
data set: Endpoint
id: main_fdp
type: MetadataService
title: main fdp
name: main fdp
description: test
publisher: UMCG MOLGENIS
license: https://creativecommons.org/licenses/by/4.0/
conforms to: fdp-specs-v1.2.html
conformsTo: fdp-specs-v1.2.html
metadata catalog: UMCG
metadataCatalog: UMCG
conforms to fdp spec: fdp-specs-v1.2.html
conformsToFdpSpec: fdp-specs-v1.2.html
mg_draft: false
mg_insertedOn: 2026-05-13T12:02:10
mg_updatedOn: 2026-05-13T12:02:10

LIFELINES_NEXT LIFELINES_NEXT Children
type: Subpopulations
type: Observation
endpoint URL: catalogue_rdf
data set: Subpopulations
source: LIFELINES_NEXT
resource: LIFELINES_NEXT
title: LIFELINES_NEXT Children
name: LIFELINES_NEXT Children
pid: https://umcgresearchdatacatalogue.nl/all/collections/LIFELINES_NEXT/subpopulations/LIFELINES_NEXT%20Children
description: Children of pregnant women included in LLNEXT. They are followed until one year after birth.
keyword: Breast milk
keywords: Breast milk
keyword: Development
keywords: Development
keyword: Urine
keywords: Urine
keyword: Blood
keywords: Blood
keyword: Cord blood
keywords: Cord blood
keyword: Healthy ageing
keywords: Healthy ageing
keyword: Birth cohort
keywords: Birth cohort
keyword: Transgenerational effects
keywords: Transgenerational effects
keyword: Meconium
keywords: Meconium
keyword: Microbiome
keywords: Microbiome
keyword: Biobank
keywords: Biobank
keyword: Feces
keywords: Feces
number of unique individuals: 1250
number of participants: 1250
counts: LIFELINES_NEXT LIFELINES_NEXT LIFELINES_NEXT Children Infant (0-23 months)
start date: 2016
inclusion start: 2016
end date: 2023
inclusion end: 2023
age groups: http://umcgresearchdatacatalogue.nl/CatalogueOntologies/api/rdf/AgeGroups/name=Infant%20%280-23%20months%29
age groups: http://umcgresearchdatacatalogue.nl/CatalogueOntologies/api/rdf/AgeGroups/name=Newborn%20%280-1%20months%29
age groups: http://umcgresearchdatacatalogue.nl/CatalogueOntologies/api/rdf/AgeGroups/name=Infants%20and%20toddlers%20%282-23%20months%29
main medical condition: http://umcgresearchdatacatalogue.nl/CatalogueOntologies/api/rdf/Diseases/name=No%20main%20medical%20condition
comorbidity: http://umcgresearchdatacatalogue.nl/CatalogueOntologies/api/rdf/Diseases/name=No%20main%20medical%20condition
countries: http://umcgresearchdatacatalogue.nl/CatalogueOntologies/api/rdf/Countries/name=Netherlands%20%28the%29
spatial: NLD
regions: http://umcgresearchdatacatalogue.nl/CatalogueOntologies/api/rdf/Regions/name=Drenthe
regions: http://umcgresearchdatacatalogue.nl/CatalogueOntologies/api/rdf/Regions/name=Groningen
regions: http://umcgresearchdatacatalogue.nl/CatalogueOntologies/api/rdf/Regions/name=Friesland
coverage: http://umcgresearchdatacatalogue.nl/CatalogueOntologies/api/rdf/Regions/name=Drenthe
coverage: http://umcgresearchdatacatalogue.nl/CatalogueOntologies/api/rdf/Regions/name=Groningen
coverage: http://umcgresearchdatacatalogue.nl/CatalogueOntologies/api/rdf/Regions/name=Friesland
other inclusion criteria: Child of LLNEXT mother
contact point: LIFELINES_NEXT Lifelines NEXT Contact
publisher: LIFELINES_NEXT UMCG
creator: LIFELINES_NEXT UMCG
theme: http://umcgresearchdatacatalogue.nl/CatalogueOntologies/api/rdf/Themes/name=Health
theme: HEAL
access rights: http://umcgresearchdatacatalogue.nl/CatalogueOntologies/api/rdf/AccessRights/name=Non%20public
access rights: NON PUBLIC
applicable legislation: http://umcgresearchdatacatalogue.nl/CatalogueOntologies/api/rdf/Legislations/name=Data%20Governance%20Act
applicable legislation: oj
mg_draft: false
mg_insertedOn: 2026-05-13T12:02:10
mg_updatedOn: 2026-05-13T12:02:10

LIFELINES_NEXT LIFELINES_NEXT Mothers
type: Subpopulations
type: Observation
endpoint URL: catalogue_rdf
data set: Subpopulations
source: LIFELINES_NEXT
resource: LIFELINES_NEXT
title: LIFELINES_NEXT Mothers
name: LIFELINES_NEXT Mothers
pid: https://umcgresearchdatacatalogue.nl/all/collections/LIFELINES_NEXT/subpopulations/LIFELINES_NEXT%20Mothers
description: Pregnant women included in LLNEXT. They are followed from the third months of pregnancy until one year after delivery.
keyword: Breast milk
keywords: Breast milk
keyword: Development
keywords: Development
keyword: Urine
keywords: Urine
keyword: Blood
keywords: Blood
keyword: Cord blood
keywords: Cord blood
keyword: Healthy ageing
keywords: Healthy ageing
keyword: Birth cohort
keywords: Birth cohort
keyword: Transgenerational effects
keywords: Transgenerational effects
keyword: Meconium
keywords: Meconium
keyword: Microbiome
keywords: Microbiome
keyword: Biobank
keywords: Biobank
keyword: Feces
keywords: Feces
number of unique individuals: 1450
number of participants: 1450
counts: LIFELINES_NEXT LIFELINES_NEXT LIFELINES_NEXT Mothers Adult (18+ years)
start date: 2016
inclusion start: 2016
end date: 2023
inclusion end: 2023
age groups: http://umcgresearchdatacatalogue.nl/CatalogueOntologies/api/rdf/AgeGroups/name=Young%20adult%20%2818-24%20years%29
age groups: http://umcgresearchdatacatalogue.nl/CatalogueOntologies/api/rdf/AgeGroups/name=Middle-aged%20%2845-64%20years%29
age groups: http://umcgresearchdatacatalogue.nl/CatalogueOntologies/api/rdf/AgeGroups/name=Adult%20%2825-44%20years%29
main medical condition: http://umcgresearchdatacatalogue.nl/CatalogueOntologies/api/rdf/Diseases/name=No%20main%20medical%20condition
comorbidity: http://umcgresearchdatacatalogue.nl/CatalogueOntologies/api/rdf/Diseases/name=No%20main%20medical%20condition
countries: http://umcgresearchdatacatalogue.nl/CatalogueOntologies/api/rdf/Countries/name=Netherlands%20%28the%29
spatial: NLD
regions: http://umcgresearchdatacatalogue.nl/CatalogueOntologies/api/rdf/Regions/name=Drenthe
regions: http://umcgresearchdatacatalogue.nl/CatalogueOntologies/api/rdf/Regions/name=Groningen
regions: http://umcgresearchdatacatalogue.nl/CatalogueOntologies/api/rdf/Regions/name=Friesland
coverage: http://umcgresearchdatacatalogue.nl/CatalogueOntologies/api/rdf/Regions/name=Drenthe
coverage: http://umcgresearchdatacatalogue.nl/CatalogueOntologies/api/rdf/Regions/name=Groningen
coverage: http://umcgresearchdatacatalogue.nl/CatalogueOntologies/api/rdf/Regions/name=Friesland
other inclusion criteria: Pregnant Residing in Groningen, Friesland or Drenthe (northern provinces of The Netherlands) Willing and able to fill in questionnaires Willing and able to donate biomaterials
contact point: LIFELINES_NEXT Lifelines NEXT Contact
publisher: LIFELINES_NEXT UMCG
creator: LIFELINES_NEXT UMCG
theme: http://umcgresearchdatacatalogue.nl/CatalogueOntologies/api/rdf/Themes/name=Health
theme: HEAL
access rights: http://umcgresearchdatacatalogue.nl/CatalogueOntologies/api/rdf/AccessRights/name=Non%20public
access rights: NON PUBLIC
applicable legislation: http://umcgresearchdatacatalogue.nl/CatalogueOntologies/api/rdf/Legislations/name=Data%20Governance%20Act
applicable legislation: oj
mg_draft: false
mg_insertedOn: 2026-05-13T12:02:10
mg_updatedOn: 2026-05-13T12:02:10

LIFELINES_NEXT LIFELINES_NEXT Partners
type: Subpopulations
type: Observation
endpoint URL: catalogue_rdf
data set: Subpopulations
source: LIFELINES_NEXT
resource: LIFELINES_NEXT
title: LIFELINES_NEXT Partners
name: LIFELINES_NEXT Partners
pid: https://umcgresearchdatacatalogue.nl/all/collections/LIFELINES_NEXT/subpopulations/LIFELINES_NEXT%20Partners
description: Partners of pregnant women included in LLNEXT. They are asked to fill in three questionnaires, provide antropometic measures and donate a blood sample.
keyword: Breast milk
keywords: Breast milk
keyword: Development
keywords: Development
keyword: Urine
keywords: Urine
keyword: Blood
keywords: Blood
keyword: Cord blood
keywords: Cord blood
keyword: Healthy ageing
keywords: Healthy ageing
keyword: Birth cohort
keywords: Birth cohort
keyword: Transgenerational effects
keywords: Transgenerational effects
keyword: Meconium
keywords: Meconium
keyword: Microbiome
keywords: Microbiome
keyword: Biobank
keywords: Biobank
keyword: Feces
keywords: Feces
number of unique individuals: 840
number of participants: 840
counts: LIFELINES_NEXT LIFELINES_NEXT LIFELINES_NEXT Partners Adult (18+ years)
start date: 2018
inclusion start: 2018
end date: 2024
inclusion end: 2024
age groups: http://umcgresearchdatacatalogue.nl/CatalogueOntologies/api/rdf/AgeGroups/name=Young%20adult%20%2818-24%20years%29
age groups: http://umcgresearchdatacatalogue.nl/CatalogueOntologies/api/rdf/AgeGroups/name=Middle-aged%20%2845-64%20years%29
age groups: http://umcgresearchdatacatalogue.nl/CatalogueOntologies/api/rdf/AgeGroups/name=Adult%20%2825-44%20years%29
main medical condition: http://umcgresearchdatacatalogue.nl/CatalogueOntologies/api/rdf/Diseases/name=No%20main%20medical%20condition
comorbidity: http://umcgresearchdatacatalogue.nl/CatalogueOntologies/api/rdf/Diseases/name=No%20main%20medical%20condition
countries: http://umcgresearchdatacatalogue.nl/CatalogueOntologies/api/rdf/Countries/name=Netherlands%20%28the%29
spatial: NLD
regions: http://umcgresearchdatacatalogue.nl/CatalogueOntologies/api/rdf/Regions/name=Drenthe
regions: http://umcgresearchdatacatalogue.nl/CatalogueOntologies/api/rdf/Regions/name=Groningen
regions: http://umcgresearchdatacatalogue.nl/CatalogueOntologies/api/rdf/Regions/name=Friesland
coverage: http://umcgresearchdatacatalogue.nl/CatalogueOntologies/api/rdf/Regions/name=Drenthe
coverage: http://umcgresearchdatacatalogue.nl/CatalogueOntologies/api/rdf/Regions/name=Groningen
coverage: http://umcgresearchdatacatalogue.nl/CatalogueOntologies/api/rdf/Regions/name=Friesland
other inclusion criteria: Partner of LLNEXT mother Willing and able to fill in questionnaires Willing and able to donate biomaterials
contact point: LIFELINES_NEXT Lifelines NEXT Contact
publisher: LIFELINES_NEXT UMCG
creator: LIFELINES_NEXT UMCG
theme: http://umcgresearchdatacatalogue.nl/CatalogueOntologies/api/rdf/Themes/name=Health
theme: HEAL
access rights: http://umcgresearchdatacatalogue.nl/CatalogueOntologies/api/rdf/AccessRights/name=Non%20public
access rights: NON PUBLIC
applicable legislation: http://umcgresearchdatacatalogue.nl/CatalogueOntologies/api/rdf/Legislations/name=Data%20Governance%20Act
applicable legislation: oj
mg_draft: false
mg_insertedOn: 2026-05-13T12:02:10
mg_updatedOn: 2026-05-13T12:02:10

OncoLifeS OncoLifeS Neuro-oncology
type: Subpopulations
type: Observation
endpoint URL: catalogue_rdf
data set: Subpopulations
source: OncoLifeS
resource: OncoLifeS
title: OncoLifeS Neuro-oncology
name: OncoLifeS Neuro-oncology
pid: https://umcgresearchdatacatalogue.nl/all/collections/OncoLifeS/subpopulations/OncoLifeS%20Neuro-oncology
description: Patients with a brain tumor or other neuro-oncological disorders, such as tumors in or near the spinal cord, or damage to the nervous system
keyword: Oncology Surgery
keywords: Oncology Surgery
keyword: Biomaterial processing
keywords: Biomaterial processing
keyword: Dermatological cancer
keywords: Dermatological cancer
keyword: Long-term outcome data
keywords: Long-term outcome data
keyword: Patient characteristics
keywords: Patient characteristics
keyword: Quality of life data
keywords: Quality of life data
keyword: lung oncology
keywords: lung oncology
keyword: Patient reported data
keywords: Patient reported data
keyword: Treatment response
keywords: Treatment response
keyword: Cancer Research Centre
keywords: Cancer Research Centre
keyword: Adolescents and young adults with cancer
keywords: Adolescents and young adults with cancer
keyword: Hereditary increased risk of breast and ovarian cancer
keywords: Hereditary increased risk of breast and ovarian cancer
keyword: Neuroendocrine tumors
keywords: Neuroendocrine tumors
keyword: Imaging data
keywords: Imaging data
keyword: Dutch Trial Register
keywords: Dutch Trial Register
keyword: gynecological oncology
keywords: gynecological oncology
keyword: Quality of care
keywords: Quality of care
keyword: Quality of life
keywords: Quality of life
keyword: European reference network on rare cancers (EURACAN)
keywords: European reference network on rare cancers (EURACAN)
keyword: Translational research
keywords: Translational research
keyword: Patient-reported data
keywords: Patient-reported data
keyword: Testicular germ-cell tumors
keywords: Testicular germ-cell tumors
keyword: Breast cancer
keywords: Breast cancer
keyword: cancer patient
keywords: cancer patient
keyword: Tumor working groups
keywords: Tumor working groups
keyword: Data protection
keywords: Data protection
keyword: Longitudinal
keywords: Longitudinal
keyword: Data collection
keywords: Data collection
keyword: Age-related disease
keywords: Age-related disease
keyword: Sarcoma
keywords: Sarcoma
keyword: Imaging data handling
keywords: Imaging data handling
keyword: Bone and soft tissue cancer
keywords: Bone and soft tissue cancer
keyword: Routine clinical care
keywords: Routine clinical care
keyword: Hematologic Cancer
keywords: Hematologic Cancer
keyword: Rare tumors

OncoLifeS OncoLifeS Hereditary Breast and Ovarian Cancer (historical)
type: Subpopulations
type: Observation
endpoint URL: catalogue_rdf
data set: Subpopulations
source: OncoLifeS
resource: OncoLifeS
title: OncoLifeS Hereditary Breast and Ovarian Cancer (historical)
name: OncoLifeS Hereditary Breast and Ovarian Cancer (historical)
pid: https://umcgresearchdatacatalogue.nl/all/collections/OncoLifeS/subpopulations/OncoLifeS%20Hereditary%20Breast%20and%20Ovarian%20Cancer%20(historical)
description: Patients with A “mutation,” or harmful genetic change, in either BRCA1 or BRCA2 gives a woman an increased lifetime risk of developing breast and ovarian cancers.
keyword: Oncology Surgery
keywords: Oncology Surgery
keyword: Biomaterial processing
keywords: Biomaterial processing
keyword: Dermatological cancer
keywords: Dermatological cancer
keyword: Long-term outcome data
keywords: Long-term outcome data
keyword: Patient characteristics
keywords: Patient characteristics
keyword: Quality of life data
keywords: Quality of life data
keyword: lung oncology
keywords: lung oncology
keyword: Patient reported data
keywords: Patient reported data
keyword: Treatment response
keywords: Treatment response
keyword: Cancer Research Centre
keywords: Cancer Research Centre
keyword: Adolescents and young adults with cancer
keywords: Adolescents and young adults with cancer
keyword: Hereditary increased risk of breast and ovarian cancer
keywords: Hereditary increased risk of breast and ovarian cancer
keyword: Neuroendocrine tumors
keywords: Neuroendocrine tumors
keyword: Imaging data
keywords: Imaging data
keyword: Dutch Trial Register
keywords: Dutch Trial Register
keyword: gynecological oncology
keywords: gynecological oncology
keyword: Quality of care
keywords: Quality of care
keyword: Quality of life
keywords: Quality of life
keyword: European reference network on rare cancers (EURACAN)
keywords: European reference network on rare cancers (EURACAN)
keyword: Translational research
keywords: Translational research
keyword: Patient-reported data
keywords: Patient-reported data
keyword: Testicular germ-cell tumors
keywords: Testicular germ-cell tumors
keyword: Breast cancer
keywords: Breast cancer
keyword: cancer patient
keywords: cancer patient
keyword: Tumor working groups
keywords: Tumor working groups
keyword: Data protection
keywords: Data protection
keyword: Longitudinal
keywords: Longitudinal
keyword: Data collection
keywords: Data collection
keyword: Age-related disease
keywords: Age-related disease
keyword: Sarcoma
keywords: Sarcoma
keyword: Imaging data handling
keywords: Imaging data handling
keyword: Bone and soft tissue cancer
keywords: Bone and soft tissue cancer
keyword: Routine clinical care
keywords: Routine clinical care
keyword: Hematologic Cancer
keywords: Hematologic Cancer
keyword: Rare tumors

AHON AHON General population
type: Subpopulations
type: Observation
endpoint URL: catalogue_rdf
data set: Subpopulations
source: AHON
resource: AHON
title: AHON General population
name: AHON General population
pid: https://umcgresearchdatacatalogue.nl/all/collections/AHON/subpopulations/AHON%20General%20population
description: Active patients on July 1st, 2024: 391000.
keyword: VCIR
keywords: VCIR
keyword: morbidity
keywords: morbidity
keyword: registry
keywords: registry
keyword: machine learning
keywords: machine learning
keyword: NHG
keywords: NHG
keyword: Natural Language Processing
keywords: Natural Language Processing
keyword: GP
keywords: GP
keyword: HIS
keywords: HIS
keyword: general practicioner
keywords: general practicioner
keyword: huisarts
keywords: huisarts
keyword: primary care
keywords: primary care
keyword: vrije teksten
keywords: vrije teksten
keyword: eerstelijnszorg
keywords: eerstelijnszorg
keyword: ATC
keywords: ATC
keyword: general practice
keywords: general practice
keyword: ICPC
keywords: ICPC
keyword: primary care data
keywords: primary care data
number of unique individuals: 600000
number of participants: 600000
counts: AHON AHON AHON General population All ages
counts: AHON AHON AHON General population Aged (65+ years)
counts: AHON AHON AHON General population Adult (18+ years)
start date: 2013
inclusion start: 2013
age groups: http://umcgresearchdatacatalogue.nl/CatalogueOntologies/api/rdf/AgeGroups/name=Infants%20and%20toddlers%20%282-23%20months%29
age groups: http://umcgresearchdatacatalogue.nl/CatalogueOntologies/api/rdf/AgeGroups/name=Adult%20%2818%2B%20years%29
age groups: http://umcgresearchdatacatalogue.nl/CatalogueOntologies/api/rdf/AgeGroups/name=Adult%20%2825-44%20years%29
age groups: http://umcgresearchdatacatalogue.nl/CatalogueOntologies/api/rdf/AgeGroups/name=Aged%20%2865%2B%20years%29
age groups: http://umcgresearchdatacatalogue.nl/CatalogueOntologies/api/rdf/AgeGroups/name=Middle-aged%20%2845-64%20years%29
age groups: http://umcgresearchdatacatalogue.nl/CatalogueOntologies/api/rdf/AgeGroups/name=All%20ages
age groups: http://umcgresearchdatacatalogue.nl/CatalogueOntologies/api/rdf/AgeGroups/name=Newborn%20%280-1%20months%29
age groups: http://umcgresearchdatacatalogue.nl/CatalogueOntologies/api/rdf/AgeGroups/name=Young%20adult%20%2818-24%20years%29
age groups: http://umcgresearchdatacatalogue.nl/CatalogueOntologies/api/rdf/AgeGroups/name=Adolescent%20%2813-17%20years%29
age groups: http://umcgresearchdatacatalogue.nl/CatalogueOntologies/api/rdf/AgeGroups/name=Infant%20%280-23%20months%29
age groups: http://umcgresearchdatacatalogue.nl/CatalogueOntologies/api/rdf/AgeGroups/name=Child%20%282-12%20years%29
main medical condition: http://umcgresearchdatacatalogue.nl/CatalogueOntologies/api/rdf/Diseases/name=No%20main%20medical%20condition
countries: http://umcgresearchdatacatalogue.nl/CatalogueOntologies/api/rdf/Countries/name=Netherlands%20%28the%29
spatial: NLD
regions: http://umcgresearchdatacatalogue.nl/CatalogueOntologies/api/rdf/Regions/name=Overijssel
regions: http://umcgresearchdatacatalogue.nl/CatalogueOntologies/api/rdf/Regions/name=Drenthe
regions: http://umcgresearchdatacatalogue.nl/CatalogueOntologies/api/rdf/Regions/name=Groningen
regions: http://umcgresearchdatacatalogue.nl/CatalogueOntologies/api/rdf/Regions/name=Friesland
coverage: http://umcgresearchdatacatalogue.nl/CatalogueOntologies/api/rdf/Regions/name=Overijssel
coverage: http://umcgresearchdatacatalogue.nl/CatalogueOntologies/api/rdf/Regions/name=Drenthe
coverage: http://umcgresearchdatacatalogue.nl/CatalogueOntologies/api/rdf/Regions/name=Groningen
coverage: http://umcgresearchdatacatalogue.nl/CatalogueOntologies/api/rdf/Regions/name=Friesland
publisher: AHON UMCG
creator: AHON UMCG
theme: http://umcgresearchdatacatalogue.nl/CatalogueOntologies/api/rdf/Themes/name=Health
theme: HEAL
access rights: http://umcgresearchdatacatalogue.nl/CatalogueOntologies/api/rdf/AccessRights/name=Non%20public
access rights: NON PUBLIC

OncoLifeS OncoLifeS Medical oncology/immunotherapy
type: Subpopulations
type: Observation
endpoint URL: catalogue_rdf
data set: Subpopulations
source: OncoLifeS
resource: OncoLifeS
title: OncoLifeS Medical oncology/immunotherapy
name: OncoLifeS Medical oncology/immunotherapy
pid: https://umcgresearchdatacatalogue.nl/all/collections/OncoLifeS/subpopulations/OncoLifeS%20Medical%20oncology/immunotherapy
description: Oncology patients treated with immunotherapy.
keyword: Oncology Surgery
keywords: Oncology Surgery
keyword: Biomaterial processing
keywords: Biomaterial processing
keyword: Dermatological cancer
keywords: Dermatological cancer
keyword: Long-term outcome data
keywords: Long-term outcome data
keyword: Patient characteristics
keywords: Patient characteristics
keyword: Quality of life data
keywords: Quality of life data
keyword: lung oncology
keywords: lung oncology
keyword: Patient reported data
keywords: Patient reported data
keyword: Treatment response
keywords: Treatment response
keyword: Cancer Research Centre
keywords: Cancer Research Centre
keyword: Adolescents and young adults with cancer
keywords: Adolescents and young adults with cancer
keyword: Hereditary increased risk of breast and ovarian cancer
keywords: Hereditary increased risk of breast and ovarian cancer
keyword: Neuroendocrine tumors
keywords: Neuroendocrine tumors
keyword: Imaging data
keywords: Imaging data
keyword: Dutch Trial Register
keywords: Dutch Trial Register
keyword: gynecological oncology
keywords: gynecological oncology
keyword: Quality of care
keywords: Quality of care
keyword: Quality of life
keywords: Quality of life
keyword: European reference network on rare cancers (EURACAN)
keywords: European reference network on rare cancers (EURACAN)
keyword: Translational research
keywords: Translational research
keyword: Patient-reported data
keywords: Patient-reported data
keyword: Testicular germ-cell tumors
keywords: Testicular germ-cell tumors
keyword: Breast cancer
keywords: Breast cancer
keyword: cancer patient
keywords: cancer patient
keyword: Tumor working groups
keywords: Tumor working groups
keyword: Data protection
keywords: Data protection
keyword: Longitudinal
keywords: Longitudinal
keyword: Data collection
keywords: Data collection
keyword: Age-related disease
keywords: Age-related disease
keyword: Sarcoma
keywords: Sarcoma
keyword: Imaging data handling
keywords: Imaging data handling
keyword: Bone and soft tissue cancer
keywords: Bone and soft tissue cancer
keyword: Routine clinical care
keywords: Routine clinical care
keyword: Hematologic Cancer
keywords: Hematologic Cancer
keyword: Rare tumors

OncoLifeS OncoLifeS Hepato Pancreato Biliary Tumors
type: Subpopulations
type: Observation
endpoint URL: catalogue_rdf
data set: Subpopulations
source: OncoLifeS
resource: OncoLifeS
title: OncoLifeS Hepato Pancreato Biliary Tumors
name: OncoLifeS Hepato Pancreato Biliary Tumors
pid: https://umcgresearchdatacatalogue.nl/all/collections/OncoLifeS/subpopulations/OncoLifeS%20Hepato%20Pancreato%20Biliary%20Tumors
description: Patients with tumors in the liver, pancreas, gallbladder and bile ducts.
keyword: Oncology Surgery
keywords: Oncology Surgery
keyword: Biomaterial processing
keywords: Biomaterial processing
keyword: Dermatological cancer
keywords: Dermatological cancer
keyword: Long-term outcome data
keywords: Long-term outcome data
keyword: Patient characteristics
keywords: Patient characteristics
keyword: Quality of life data
keywords: Quality of life data
keyword: lung oncology
keywords: lung oncology
keyword: Patient reported data
keywords: Patient reported data
keyword: Treatment response
keywords: Treatment response
keyword: Cancer Research Centre
keywords: Cancer Research Centre
keyword: Adolescents and young adults with cancer
keywords: Adolescents and young adults with cancer
keyword: Hereditary increased risk of breast and ovarian cancer
keywords: Hereditary increased risk of breast and ovarian cancer
keyword: Neuroendocrine tumors
keywords: Neuroendocrine tumors
keyword: Imaging data
keywords: Imaging data
keyword: Dutch Trial Register
keywords: Dutch Trial Register
keyword: gynecological oncology
keywords: gynecological oncology
keyword: Quality of care
keywords: Quality of care
keyword: Quality of life
keywords: Quality of life
keyword: European reference network on rare cancers (EURACAN)
keywords: European reference network on rare cancers (EURACAN)
keyword: Translational research
keywords: Translational research
keyword: Patient-reported data
keywords: Patient-reported data
keyword: Testicular germ-cell tumors
keywords: Testicular germ-cell tumors
keyword: Breast cancer
keywords: Breast cancer
keyword: cancer patient
keywords: cancer patient
keyword: Tumor working groups
keywords: Tumor working groups
keyword: Data protection
keywords: Data protection
keyword: Longitudinal
keywords: Longitudinal
keyword: Data collection
keywords: Data collection
keyword: Age-related disease
keywords: Age-related disease
keyword: Sarcoma
keywords: Sarcoma
keyword: Imaging data handling
keywords: Imaging data handling
keyword: Bone and soft tissue cancer
keywords: Bone and soft tissue cancer
keyword: Routine clinical care
keywords: Routine clinical care
keyword: Hematologic Cancer
keywords: Hematologic Cancer
keyword: Rare tumors

AHON AHON RNG
type: Subpopulations
type: Observation
endpoint URL: catalogue_rdf
data set: Subpopulations
source: AHON
resource: AHON
title: AHON RNG
name: AHON RNG
pid: https://umcgresearchdatacatalogue.nl/all/collections/AHON/subpopulations/AHON%20RNG
description: Registratie Netwerk Groningen (RNG), predecessor of AHON, with information from 3 GP practices collected during 1998 - 2013.
keyword: VCIR
keywords: VCIR
keyword: morbidity
keywords: morbidity
keyword: registry
keywords: registry
keyword: machine learning
keywords: machine learning
keyword: NHG
keywords: NHG
keyword: Natural Language Processing
keywords: Natural Language Processing
keyword: GP
keywords: GP
keyword: HIS
keywords: HIS
keyword: general practicioner
keywords: general practicioner
keyword: huisarts
keywords: huisarts
keyword: primary care
keywords: primary care
keyword: vrije teksten
keywords: vrije teksten
keyword: eerstelijnszorg
keywords: eerstelijnszorg
keyword: ATC
keywords: ATC
keyword: general practice
keywords: general practice
keyword: ICPC
keywords: ICPC
keyword: primary care data
keywords: primary care data
number of unique individuals: 60000
number of participants: 60000
start date: 1998
inclusion start: 1998
end date: 2013
inclusion end: 2013
age groups: http://umcgresearchdatacatalogue.nl/CatalogueOntologies/api/rdf/AgeGroups/name=Infants%20and%20toddlers%20%282-23%20months%29
age groups: http://umcgresearchdatacatalogue.nl/CatalogueOntologies/api/rdf/AgeGroups/name=Adult%20%2818%2B%20years%29
age groups: http://umcgresearchdatacatalogue.nl/CatalogueOntologies/api/rdf/AgeGroups/name=Adult%20%2825-44%20years%29
age groups: http://umcgresearchdatacatalogue.nl/CatalogueOntologies/api/rdf/AgeGroups/name=Aged%20%2865%2B%20years%29
age groups: http://umcgresearchdatacatalogue.nl/CatalogueOntologies/api/rdf/AgeGroups/name=Middle-aged%20%2845-64%20years%29
age groups: http://umcgresearchdatacatalogue.nl/CatalogueOntologies/api/rdf/AgeGroups/name=All%20ages
age groups: http://umcgresearchdatacatalogue.nl/CatalogueOntologies/api/rdf/AgeGroups/name=Newborn%20%280-1%20months%29
age groups: http://umcgresearchdatacatalogue.nl/CatalogueOntologies/api/rdf/AgeGroups/name=Young%20adult%20%2818-24%20years%29
age groups: http://umcgresearchdatacatalogue.nl/CatalogueOntologies/api/rdf/AgeGroups/name=Adolescent%20%2813-17%20years%29
age groups: http://umcgresearchdatacatalogue.nl/CatalogueOntologies/api/rdf/AgeGroups/name=Infant%20%280-23%20months%29
age groups: http://umcgresearchdatacatalogue.nl/CatalogueOntologies/api/rdf/AgeGroups/name=Child%20%282-12%20years%29
main medical condition: http://umcgresearchdatacatalogue.nl/CatalogueOntologies/api/rdf/Diseases/name=No%20main%20medical%20condition
countries: http://umcgresearchdatacatalogue.nl/CatalogueOntologies/api/rdf/Countries/name=Netherlands%20%28the%29
spatial: NLD
regions: http://umcgresearchdatacatalogue.nl/CatalogueOntologies/api/rdf/Regions/name=Overijssel
regions: http://umcgresearchdatacatalogue.nl/CatalogueOntologies/api/rdf/Regions/name=Drenthe
regions: http://umcgresearchdatacatalogue.nl/CatalogueOntologies/api/rdf/Regions/name=Groningen
regions: http://umcgresearchdatacatalogue.nl/CatalogueOntologies/api/rdf/Regions/name=Friesland
coverage: http://umcgresearchdatacatalogue.nl/CatalogueOntologies/api/rdf/Regions/name=Overijssel
coverage: http://umcgresearchdatacatalogue.nl/CatalogueOntologies/api/rdf/Regions/name=Drenthe
coverage: http://umcgresearchdatacatalogue.nl/CatalogueOntologies/api/rdf/Regions/name=Groningen
coverage: http://umcgresearchdatacatalogue.nl/CatalogueOntologies/api/rdf/Regions/name=Friesland
publisher: AHON UMCG
creator: AHON UMCG
theme: http://umcgresearchdatacatalogue.nl/CatalogueOntologies/api/rdf/Themes/name=Health
theme: HEAL
access rights: http://umcgresearchdatacatalogue.nl/CatalogueOntologies/api/rdf/AccessRights/name=Non%20public
access rights: NON PUBLIC
applicable legislation: http://umcgresearchdatacatalogue.nl/CatalogueOntologies/api/rdf/Legislations/name=Data%20Governance%20Act

OncoLifeS OncoLifeS Esophageal and Stomach Carcinoma
type: Subpopulations
type: Observation
endpoint URL: catalogue_rdf
data set: Subpopulations
source: OncoLifeS
resource: OncoLifeS
title: OncoLifeS Esophageal and Stomach Carcinoma
name: OncoLifeS Esophageal and Stomach Carcinoma
pid: https://umcgresearchdatacatalogue.nl/all/collections/OncoLifeS/subpopulations/OncoLifeS%20Esophageal%20and%20Stomach%20Carcinoma
description: Patients with oesophageal, gastric cancer and Barrett's esophagus.
keyword: Oncology Surgery
keywords: Oncology Surgery
keyword: Biomaterial processing
keywords: Biomaterial processing
keyword: Dermatological cancer
keywords: Dermatological cancer
keyword: Long-term outcome data
keywords: Long-term outcome data
keyword: Patient characteristics
keywords: Patient characteristics
keyword: Quality of life data
keywords: Quality of life data
keyword: lung oncology
keywords: lung oncology
keyword: Patient reported data
keywords: Patient reported data
keyword: Treatment response
keywords: Treatment response
keyword: Cancer Research Centre
keywords: Cancer Research Centre
keyword: Adolescents and young adults with cancer
keywords: Adolescents and young adults with cancer
keyword: Hereditary increased risk of breast and ovarian cancer
keywords: Hereditary increased risk of breast and ovarian cancer
keyword: Neuroendocrine tumors
keywords: Neuroendocrine tumors
keyword: Imaging data
keywords: Imaging data
keyword: Dutch Trial Register
keywords: Dutch Trial Register
keyword: gynecological oncology
keywords: gynecological oncology
keyword: Quality of care
keywords: Quality of care
keyword: Quality of life
keywords: Quality of life
keyword: European reference network on rare cancers (EURACAN)
keywords: European reference network on rare cancers (EURACAN)
keyword: Translational research
keywords: Translational research
keyword: Patient-reported data
keywords: Patient-reported data
keyword: Testicular germ-cell tumors
keywords: Testicular germ-cell tumors
keyword: Breast cancer
keywords: Breast cancer
keyword: cancer patient
keywords: cancer patient
keyword: Tumor working groups
keywords: Tumor working groups
keyword: Data protection
keywords: Data protection
keyword: Longitudinal
keywords: Longitudinal
keyword: Data collection
keywords: Data collection
keyword: Age-related disease
keywords: Age-related disease
keyword: Sarcoma
keywords: Sarcoma
keyword: Imaging data handling
keywords: Imaging data handling
keyword: Bone and soft tissue cancer
keywords: Bone and soft tissue cancer
keyword: Routine clinical care
keywords: Routine clinical care
keyword: Hematologic Cancer
keywords: Hematologic Cancer
keyword: Rare tumors

OncoLifeS OncoLifeS Neuro-endocrine oncology
type: Subpopulations
type: Observation
endpoint URL: catalogue_rdf
data set: Subpopulations
source: OncoLifeS
resource: OncoLifeS
title: OncoLifeS Neuro-endocrine oncology
name: OncoLifeS Neuro-endocrine oncology
pid: https://umcgresearchdatacatalogue.nl/all/collections/OncoLifeS/subpopulations/OncoLifeS%20Neuro-endocrine%20oncology
description: Oncology patients with a neuroendocrine (NET) tumor.
keyword: Oncology Surgery
keywords: Oncology Surgery
keyword: Biomaterial processing
keywords: Biomaterial processing
keyword: Dermatological cancer
keywords: Dermatological cancer
keyword: Long-term outcome data
keywords: Long-term outcome data
keyword: Patient characteristics
keywords: Patient characteristics
keyword: Quality of life data
keywords: Quality of life data
keyword: lung oncology
keywords: lung oncology
keyword: Patient reported data
keywords: Patient reported data
keyword: Treatment response
keywords: Treatment response
keyword: Cancer Research Centre
keywords: Cancer Research Centre
keyword: Adolescents and young adults with cancer
keywords: Adolescents and young adults with cancer
keyword: Hereditary increased risk of breast and ovarian cancer
keywords: Hereditary increased risk of breast and ovarian cancer
keyword: Neuroendocrine tumors
keywords: Neuroendocrine tumors
keyword: Imaging data
keywords: Imaging data
keyword: Dutch Trial Register
keywords: Dutch Trial Register
keyword: gynecological oncology
keywords: gynecological oncology
keyword: Quality of care
keywords: Quality of care
keyword: Quality of life
keywords: Quality of life
keyword: European reference network on rare cancers (EURACAN)
keywords: European reference network on rare cancers (EURACAN)
keyword: Translational research
keywords: Translational research
keyword: Patient-reported data
keywords: Patient-reported data
keyword: Testicular germ-cell tumors
keywords: Testicular germ-cell tumors
keyword: Breast cancer
keywords: Breast cancer
keyword: cancer patient
keywords: cancer patient
keyword: Tumor working groups
keywords: Tumor working groups
keyword: Data protection
keywords: Data protection
keyword: Longitudinal
keywords: Longitudinal
keyword: Data collection
keywords: Data collection
keyword: Age-related disease
keywords: Age-related disease
keyword: Sarcoma
keywords: Sarcoma
keyword: Imaging data handling
keywords: Imaging data handling
keyword: Bone and soft tissue cancer
keywords: Bone and soft tissue cancer
keyword: Routine clinical care
keywords: Routine clinical care
keyword: Hematologic Cancer
keywords: Hematologic Cancer
keyword: Rare tumors

OncoLifeS OncoLifeS Testicular oncology
type: Subpopulations
type: Observation
endpoint URL: catalogue_rdf
data set: Subpopulations
source: OncoLifeS
resource: OncoLifeS
title: OncoLifeS Testicular oncology
name: OncoLifeS Testicular oncology
pid: https://umcgresearchdatacatalogue.nl/all/collections/OncoLifeS/subpopulations/OncoLifeS%20Testicular%20oncology
description: Patients with germ cell tumors (seminoma and non-seminoma)) of the testis
keyword: Oncology Surgery
keywords: Oncology Surgery
keyword: Biomaterial processing
keywords: Biomaterial processing
keyword: Dermatological cancer
keywords: Dermatological cancer
keyword: Long-term outcome data
keywords: Long-term outcome data
keyword: Patient characteristics
keywords: Patient characteristics
keyword: Quality of life data
keywords: Quality of life data
keyword: lung oncology
keywords: lung oncology
keyword: Patient reported data
keywords: Patient reported data
keyword: Treatment response
keywords: Treatment response
keyword: Cancer Research Centre
keywords: Cancer Research Centre
keyword: Adolescents and young adults with cancer
keywords: Adolescents and young adults with cancer
keyword: Hereditary increased risk of breast and ovarian cancer
keywords: Hereditary increased risk of breast and ovarian cancer
keyword: Neuroendocrine tumors
keywords: Neuroendocrine tumors
keyword: Imaging data
keywords: Imaging data
keyword: Dutch Trial Register
keywords: Dutch Trial Register
keyword: gynecological oncology
keywords: gynecological oncology
keyword: Quality of care
keywords: Quality of care
keyword: Quality of life
keywords: Quality of life
keyword: European reference network on rare cancers (EURACAN)
keywords: European reference network on rare cancers (EURACAN)
keyword: Translational research
keywords: Translational research
keyword: Patient-reported data
keywords: Patient-reported data
keyword: Testicular germ-cell tumors
keywords: Testicular germ-cell tumors
keyword: Breast cancer
keywords: Breast cancer
keyword: cancer patient
keywords: cancer patient
keyword: Tumor working groups
keywords: Tumor working groups
keyword: Data protection
keywords: Data protection
keyword: Longitudinal
keywords: Longitudinal
keyword: Data collection
keywords: Data collection
keyword: Age-related disease
keywords: Age-related disease
keyword: Sarcoma
keywords: Sarcoma
keyword: Imaging data handling
keywords: Imaging data handling
keyword: Bone and soft tissue cancer
keywords: Bone and soft tissue cancer
keyword: Routine clinical care
keywords: Routine clinical care
keyword: Hematologic Cancer
keywords: Hematologic Cancer
keyword: Rare tumors

OncoLifeS OncoLifeS Gynecological oncology
type: Subpopulations
type: Observation
endpoint URL: catalogue_rdf
data set: Subpopulations
source: OncoLifeS
resource: OncoLifeS
title: OncoLifeS Gynecological oncology
name: OncoLifeS Gynecological oncology
pid: https://umcgresearchdatacatalogue.nl/all/collections/OncoLifeS/subpopulations/OncoLifeS%20Gynecological%20oncology
description: Tumors of the female reproductive system, such as ovarian cancer, vaginal cancer, cervical cancer, vulva cancer.
keyword: Oncology Surgery
keywords: Oncology Surgery
keyword: Biomaterial processing
keywords: Biomaterial processing
keyword: Dermatological cancer
keywords: Dermatological cancer
keyword: Long-term outcome data
keywords: Long-term outcome data
keyword: Patient characteristics
keywords: Patient characteristics
keyword: Quality of life data
keywords: Quality of life data
keyword: lung oncology
keywords: lung oncology
keyword: Patient reported data
keywords: Patient reported data
keyword: Treatment response
keywords: Treatment response
keyword: Cancer Research Centre
keywords: Cancer Research Centre
keyword: Adolescents and young adults with cancer
keywords: Adolescents and young adults with cancer
keyword: Hereditary increased risk of breast and ovarian cancer
keywords: Hereditary increased risk of breast and ovarian cancer
keyword: Neuroendocrine tumors
keywords: Neuroendocrine tumors
keyword: Imaging data
keywords: Imaging data
keyword: Dutch Trial Register
keywords: Dutch Trial Register
keyword: gynecological oncology
keywords: gynecological oncology
keyword: Quality of care
keywords: Quality of care
keyword: Quality of life
keywords: Quality of life
keyword: European reference network on rare cancers (EURACAN)
keywords: European reference network on rare cancers (EURACAN)
keyword: Translational research
keywords: Translational research
keyword: Patient-reported data
keywords: Patient-reported data
keyword: Testicular germ-cell tumors
keywords: Testicular germ-cell tumors
keyword: Breast cancer
keywords: Breast cancer
keyword: cancer patient
keywords: cancer patient
keyword: Tumor working groups
keywords: Tumor working groups
keyword: Data protection
keywords: Data protection
keyword: Longitudinal
keywords: Longitudinal
keyword: Data collection
keywords: Data collection
keyword: Age-related disease
keywords: Age-related disease
keyword: Sarcoma
keywords: Sarcoma
keyword: Imaging data handling
keywords: Imaging data handling
keyword: Bone and soft tissue cancer
keywords: Bone and soft tissue cancer
keyword: Routine clinical care
keywords: Routine clinical care
keyword: Hematologic Cancer
keywords: Hematologic Cancer
keyword: Rare tumors

OncoLifeS OncoLifeS Adolescents and young adults (AYA)
type: Subpopulations
type: Observation
endpoint URL: catalogue_rdf
data set: Subpopulations
source: OncoLifeS
resource: OncoLifeS
title: OncoLifeS Adolescents and young adults (AYA)
name: OncoLifeS Adolescents and young adults (AYA)
pid: https://umcgresearchdatacatalogue.nl/all/collections/OncoLifeS/subpopulations/OncoLifeS%20Adolescents%20and%20young%20adults%20(AYA)
description: Adolescents and young adults (AYAs) diagnosed with cancer between the ages of 18 and 39.
keyword: Oncology Surgery
keywords: Oncology Surgery
keyword: Biomaterial processing
keywords: Biomaterial processing
keyword: Dermatological cancer
keywords: Dermatological cancer
keyword: Long-term outcome data
keywords: Long-term outcome data
keyword: Patient characteristics
keywords: Patient characteristics
keyword: Quality of life data
keywords: Quality of life data
keyword: lung oncology
keywords: lung oncology
keyword: Patient reported data
keywords: Patient reported data
keyword: Treatment response
keywords: Treatment response
keyword: Cancer Research Centre
keywords: Cancer Research Centre
keyword: Adolescents and young adults with cancer
keywords: Adolescents and young adults with cancer
keyword: Hereditary increased risk of breast and ovarian cancer
keywords: Hereditary increased risk of breast and ovarian cancer
keyword: Neuroendocrine tumors
keywords: Neuroendocrine tumors
keyword: Imaging data
keywords: Imaging data
keyword: Dutch Trial Register
keywords: Dutch Trial Register
keyword: gynecological oncology
keywords: gynecological oncology
keyword: Quality of care
keywords: Quality of care
keyword: Quality of life
keywords: Quality of life
keyword: European reference network on rare cancers (EURACAN)
keywords: European reference network on rare cancers (EURACAN)
keyword: Translational research
keywords: Translational research
keyword: Patient-reported data
keywords: Patient-reported data
keyword: Testicular germ-cell tumors
keywords: Testicular germ-cell tumors
keyword: Breast cancer
keywords: Breast cancer
keyword: cancer patient
keywords: cancer patient
keyword: Tumor working groups
keywords: Tumor working groups
keyword: Data protection
keywords: Data protection
keyword: Longitudinal
keywords: Longitudinal
keyword: Data collection
keywords: Data collection
keyword: Age-related disease
keywords: Age-related disease
keyword: Sarcoma
keywords: Sarcoma
keyword: Imaging data handling
keywords: Imaging data handling
keyword: Bone and soft tissue cancer
keywords: Bone and soft tissue cancer
keyword: Routine clinical care
keywords: Routine clinical care
keyword: Hematologic Cancer
keywords: Hematologic Cancer
keyword: Rare tumors

OncoLifeS OncoLifeS Anaplastic thyroid carcinoma
type: Subpopulations
type: Observation
endpoint URL: catalogue_rdf
data set: Subpopulations
source: OncoLifeS
resource: OncoLifeS
title: OncoLifeS Anaplastic thyroid carcinoma
name: OncoLifeS Anaplastic thyroid carcinoma
pid: https://umcgresearchdatacatalogue.nl/all/collections/OncoLifeS/subpopulations/OncoLifeS%20Anaplastic%20thyroid%20carcinoma
description: Patients with an Anaplastic thyroid carcinoma (ATC).
keyword: Oncology Surgery
keywords: Oncology Surgery
keyword: Biomaterial processing
keywords: Biomaterial processing
keyword: Dermatological cancer
keywords: Dermatological cancer
keyword: Long-term outcome data
keywords: Long-term outcome data
keyword: Patient characteristics
keywords: Patient characteristics
keyword: Quality of life data
keywords: Quality of life data
keyword: lung oncology
keywords: lung oncology
keyword: Patient reported data
keywords: Patient reported data
keyword: Treatment response
keywords: Treatment response
keyword: Cancer Research Centre
keywords: Cancer Research Centre
keyword: Adolescents and young adults with cancer
keywords: Adolescents and young adults with cancer
keyword: Hereditary increased risk of breast and ovarian cancer
keywords: Hereditary increased risk of breast and ovarian cancer
keyword: Neuroendocrine tumors
keywords: Neuroendocrine tumors
keyword: Imaging data
keywords: Imaging data
keyword: Dutch Trial Register
keywords: Dutch Trial Register
keyword: gynecological oncology
keywords: gynecological oncology
keyword: Quality of care
keywords: Quality of care
keyword: Quality of life
keywords: Quality of life
keyword: European reference network on rare cancers (EURACAN)
keywords: European reference network on rare cancers (EURACAN)
keyword: Translational research
keywords: Translational research
keyword: Patient-reported data
keywords: Patient-reported data
keyword: Testicular germ-cell tumors
keywords: Testicular germ-cell tumors
keyword: Breast cancer
keywords: Breast cancer
keyword: cancer patient
keywords: cancer patient
keyword: Tumor working groups
keywords: Tumor working groups
keyword: Data protection
keywords: Data protection
keyword: Longitudinal
keywords: Longitudinal
keyword: Data collection
keywords: Data collection
keyword: Age-related disease
keywords: Age-related disease
keyword: Sarcoma
keywords: Sarcoma
keyword: Imaging data handling
keywords: Imaging data handling
keyword: Bone and soft tissue cancer
keywords: Bone and soft tissue cancer
keyword: Routine clinical care
keywords: Routine clinical care
keyword: Hematologic Cancer
keywords: Hematologic Cancer
keyword: Rare tumors

OncoLifeS OncoLifeS Adrenal cancer
type: Subpopulations
type: Observation
endpoint URL: catalogue_rdf
data set: Subpopulations
source: OncoLifeS
resource: OncoLifeS
title: OncoLifeS Adrenal cancer
name: OncoLifeS Adrenal cancer
pid: https://umcgresearchdatacatalogue.nl/all/collections/OncoLifeS/subpopulations/OncoLifeS%20Adrenal%20cancer
description: The type of cancer in the cortex of the adrenal gland.
keyword: Oncology Surgery
keywords: Oncology Surgery
keyword: Biomaterial processing
keywords: Biomaterial processing
keyword: Dermatological cancer
keywords: Dermatological cancer
keyword: Long-term outcome data
keywords: Long-term outcome data
keyword: Patient characteristics
keywords: Patient characteristics
keyword: Quality of life data
keywords: Quality of life data
keyword: lung oncology
keywords: lung oncology
keyword: Patient reported data
keywords: Patient reported data
keyword: Treatment response
keywords: Treatment response
keyword: Cancer Research Centre
keywords: Cancer Research Centre
keyword: Adolescents and young adults with cancer
keywords: Adolescents and young adults with cancer
keyword: Hereditary increased risk of breast and ovarian cancer
keywords: Hereditary increased risk of breast and ovarian cancer
keyword: Neuroendocrine tumors
keywords: Neuroendocrine tumors
keyword: Imaging data
keywords: Imaging data
keyword: Dutch Trial Register
keywords: Dutch Trial Register
keyword: gynecological oncology
keywords: gynecological oncology
keyword: Quality of care
keywords: Quality of care
keyword: Quality of life
keywords: Quality of life
keyword: European reference network on rare cancers (EURACAN)
keywords: European reference network on rare cancers (EURACAN)
keyword: Translational research
keywords: Translational research
keyword: Patient-reported data
keywords: Patient-reported data
keyword: Testicular germ-cell tumors
keywords: Testicular germ-cell tumors
keyword: Breast cancer
keywords: Breast cancer
keyword: cancer patient
keywords: cancer patient
keyword: Tumor working groups
keywords: Tumor working groups
keyword: Data protection
keywords: Data protection
keyword: Longitudinal
keywords: Longitudinal
keyword: Data collection
keywords: Data collection
keyword: Age-related disease
keywords: Age-related disease
keyword: Sarcoma
keywords: Sarcoma
keyword: Imaging data handling
keywords: Imaging data handling
keyword: Bone and soft tissue cancer
keywords: Bone and soft tissue cancer
keyword: Routine clinical care
keywords: Routine clinical care
keyword: Hematologic Cancer
keywords: Hematologic Cancer
keyword: Rare tumors

OncoLifeS OncoLifeS Bone and soft-tissue oncology
type: Subpopulations
type: Observation
endpoint URL: catalogue_rdf
data set: Subpopulations
source: OncoLifeS
resource: OncoLifeS
title: OncoLifeS Bone and soft-tissue oncology
name: OncoLifeS Bone and soft-tissue oncology
pid: https://umcgresearchdatacatalogue.nl/all/collections/OncoLifeS/subpopulations/OncoLifeS%20Bone%20and%20soft-tissue%20oncology
description: Bone and Soft Tissue Tumors, such as sarcomas and Gastro Intestinale Stroma Tumor (GIST).
keyword: Oncology Surgery
keywords: Oncology Surgery
keyword: Biomaterial processing
keywords: Biomaterial processing
keyword: Dermatological cancer
keywords: Dermatological cancer
keyword: Long-term outcome data
keywords: Long-term outcome data
keyword: Patient characteristics
keywords: Patient characteristics
keyword: Quality of life data
keywords: Quality of life data
keyword: lung oncology
keywords: lung oncology
keyword: Patient reported data
keywords: Patient reported data
keyword: Treatment response
keywords: Treatment response
keyword: Cancer Research Centre
keywords: Cancer Research Centre
keyword: Adolescents and young adults with cancer
keywords: Adolescents and young adults with cancer
keyword: Hereditary increased risk of breast and ovarian cancer
keywords: Hereditary increased risk of breast and ovarian cancer
keyword: Neuroendocrine tumors
keywords: Neuroendocrine tumors
keyword: Imaging data
keywords: Imaging data
keyword: Dutch Trial Register
keywords: Dutch Trial Register
keyword: gynecological oncology
keywords: gynecological oncology
keyword: Quality of care
keywords: Quality of care
keyword: Quality of life
keywords: Quality of life
keyword: European reference network on rare cancers (EURACAN)
keywords: European reference network on rare cancers (EURACAN)
keyword: Translational research
keywords: Translational research
keyword: Patient-reported data
keywords: Patient-reported data
keyword: Testicular germ-cell tumors
keywords: Testicular germ-cell tumors
keyword: Breast cancer
keywords: Breast cancer
keyword: cancer patient
keywords: cancer patient
keyword: Tumor working groups
keywords: Tumor working groups
keyword: Data protection
keywords: Data protection
keyword: Longitudinal
keywords: Longitudinal
keyword: Data collection
keywords: Data collection
keyword: Age-related disease
keywords: Age-related disease
keyword: Sarcoma
keywords: Sarcoma
keyword: Imaging data handling
keywords: Imaging data handling
keyword: Bone and soft tissue cancer
keywords: Bone and soft tissue cancer
keyword: Routine clinical care
keywords: Routine clinical care
keyword: Hematologic Cancer
keywords: Hematologic Cancer
keyword: Rare tumors

OncoLifeS OncoLifeS Hematological oncology
type: Subpopulations
type: Observation
endpoint URL: catalogue_rdf
data set: Subpopulations
source: OncoLifeS
resource: OncoLifeS
title: OncoLifeS Hematological oncology
name: OncoLifeS Hematological oncology
pid: https://umcgresearchdatacatalogue.nl/all/collections/OncoLifeS/subpopulations/OncoLifeS%20Hematological%20oncology
description: Oncology patients with a hematologic tumor, such as lymph node cancer, plasma cell tumors, leukemia, myelodysplastic syndromes (MDS), myeloproliferative disorders (MPN), diffuse large B-cell lymphoma (DLBCL), follicular lymphoma (FL) and multiple myeloma (MM).
keyword: Oncology Surgery
keywords: Oncology Surgery
keyword: Biomaterial processing
keywords: Biomaterial processing
keyword: Dermatological cancer
keywords: Dermatological cancer
keyword: Long-term outcome data
keywords: Long-term outcome data
keyword: Patient characteristics
keywords: Patient characteristics
keyword: Quality of life data
keywords: Quality of life data
keyword: lung oncology
keywords: lung oncology
keyword: Patient reported data
keywords: Patient reported data
keyword: Treatment response
keywords: Treatment response
keyword: Cancer Research Centre
keywords: Cancer Research Centre
keyword: Adolescents and young adults with cancer
keywords: Adolescents and young adults with cancer
keyword: Hereditary increased risk of breast and ovarian cancer
keywords: Hereditary increased risk of breast and ovarian cancer
keyword: Neuroendocrine tumors
keywords: Neuroendocrine tumors
keyword: Imaging data
keywords: Imaging data
keyword: Dutch Trial Register
keywords: Dutch Trial Register
keyword: gynecological oncology
keywords: gynecological oncology
keyword: Quality of care
keywords: Quality of care
keyword: Quality of life
keywords: Quality of life
keyword: European reference network on rare cancers (EURACAN)
keywords: European reference network on rare cancers (EURACAN)
keyword: Translational research
keywords: Translational research
keyword: Patient-reported data
keywords: Patient-reported data
keyword: Testicular germ-cell tumors
keywords: Testicular germ-cell tumors
keyword: Breast cancer
keywords: Breast cancer
keyword: cancer patient
keywords: cancer patient
keyword: Tumor working groups
keywords: Tumor working groups
keyword: Data protection
keywords: Data protection
keyword: Longitudinal
keywords: Longitudinal
keyword: Data collection
keywords: Data collection
keyword: Age-related disease
keywords: Age-related disease
keyword: Sarcoma
keywords: Sarcoma
keyword: Imaging data handling
keywords: Imaging data handling
keyword: Bone and soft tissue cancer
keywords: Bone and soft tissue cancer
keyword: Routine clinical care
keywords: Routine clinical care
keyword: Hematologic Cancer
keywords: Hematologic Cancer
keyword: Rare tumors

OncoLifeS OncoLifeS Colorectal cancer
type: Subpopulations
type: Observation
endpoint URL: catalogue_rdf
data set: Subpopulations
source: OncoLifeS
resource: OncoLifeS
title: OncoLifeS Colorectal cancer
name: OncoLifeS Colorectal cancer
pid: https://umcgresearchdatacatalogue.nl/all/collections/OncoLifeS/subpopulations/OncoLifeS%20Colorectal%20cancer
description: Patients with small intestine, colon, rectum and anal cancer and patients with a hereditary predisposition to colorectal cancer.
keyword: Oncology Surgery
keywords: Oncology Surgery
keyword: Biomaterial processing
keywords: Biomaterial processing
keyword: Dermatological cancer
keywords: Dermatological cancer
keyword: Long-term outcome data
keywords: Long-term outcome data
keyword: Patient characteristics
keywords: Patient characteristics
keyword: Quality of life data
keywords: Quality of life data
keyword: lung oncology
keywords: lung oncology
keyword: Patient reported data
keywords: Patient reported data
keyword: Treatment response
keywords: Treatment response
keyword: Cancer Research Centre
keywords: Cancer Research Centre
keyword: Adolescents and young adults with cancer
keywords: Adolescents and young adults with cancer
keyword: Hereditary increased risk of breast and ovarian cancer
keywords: Hereditary increased risk of breast and ovarian cancer
keyword: Neuroendocrine tumors
keywords: Neuroendocrine tumors
keyword: Imaging data
keywords: Imaging data
keyword: Dutch Trial Register
keywords: Dutch Trial Register
keyword: gynecological oncology
keywords: gynecological oncology
keyword: Quality of care
keywords: Quality of care
keyword: Quality of life
keywords: Quality of life
keyword: European reference network on rare cancers (EURACAN)
keywords: European reference network on rare cancers (EURACAN)
keyword: Translational research
keywords: Translational research
keyword: Patient-reported data
keywords: Patient-reported data
keyword: Testicular germ-cell tumors
keywords: Testicular germ-cell tumors
keyword: Breast cancer
keywords: Breast cancer
keyword: cancer patient
keywords: cancer patient
keyword: Tumor working groups
keywords: Tumor working groups
keyword: Data protection
keywords: Data protection
keyword: Longitudinal
keywords: Longitudinal
keyword: Data collection
keywords: Data collection
keyword: Age-related disease
keywords: Age-related disease
keyword: Sarcoma
keywords: Sarcoma
keyword: Imaging data handling
keywords: Imaging data handling
keyword: Bone and soft tissue cancer
keywords: Bone and soft tissue cancer
keyword: Routine clinical care
keywords: Routine clinical care
keyword: Hematologic Cancer
keywords: Hematologic Cancer
keyword: Rare tumors

OncoLifeS OncoLifeS Skin cancer
type: Subpopulations
type: Observation
endpoint URL: catalogue_rdf
data set: Subpopulations
source: OncoLifeS
resource: OncoLifeS
title: OncoLifeS Skin cancer
name: OncoLifeS Skin cancer
pid: https://umcgresearchdatacatalogue.nl/all/collections/OncoLifeS/subpopulations/OncoLifeS%20Skin%20cancer
description: Patients with squamous cell carcinoma
keyword: Oncology Surgery
keywords: Oncology Surgery
keyword: Biomaterial processing
keywords: Biomaterial processing
keyword: Dermatological cancer
keywords: Dermatological cancer
keyword: Long-term outcome data
keywords: Long-term outcome data
keyword: Patient characteristics
keywords: Patient characteristics
keyword: Quality of life data
keywords: Quality of life data
keyword: lung oncology
keywords: lung oncology
keyword: Patient reported data
keywords: Patient reported data
keyword: Treatment response
keywords: Treatment response
keyword: Cancer Research Centre
keywords: Cancer Research Centre
keyword: Adolescents and young adults with cancer
keywords: Adolescents and young adults with cancer
keyword: Hereditary increased risk of breast and ovarian cancer
keywords: Hereditary increased risk of breast and ovarian cancer
keyword: Neuroendocrine tumors
keywords: Neuroendocrine tumors
keyword: Imaging data
keywords: Imaging data
keyword: Dutch Trial Register
keywords: Dutch Trial Register
keyword: gynecological oncology
keywords: gynecological oncology
keyword: Quality of care
keywords: Quality of care
keyword: Quality of life
keywords: Quality of life
keyword: European reference network on rare cancers (EURACAN)
keywords: European reference network on rare cancers (EURACAN)
keyword: Translational research
keywords: Translational research
keyword: Patient-reported data
keywords: Patient-reported data
keyword: Testicular germ-cell tumors
keywords: Testicular germ-cell tumors
keyword: Breast cancer
keywords: Breast cancer
keyword: cancer patient
keywords: cancer patient
keyword: Tumor working groups
keywords: Tumor working groups
keyword: Data protection
keywords: Data protection
keyword: Longitudinal
keywords: Longitudinal
keyword: Data collection
keywords: Data collection
keyword: Age-related disease
keywords: Age-related disease
keyword: Sarcoma
keywords: Sarcoma
keyword: Imaging data handling
keywords: Imaging data handling
keyword: Bone and soft tissue cancer
keywords: Bone and soft tissue cancer
keyword: Routine clinical care
keywords: Routine clinical care
keyword: Hematologic Cancer
keywords: Hematologic Cancer
keyword: Rare tumors

OncoLifeS OncoLifeS Hereditary Breast and Ovarian Cancer
type: Subpopulations
type: Observation
endpoint URL: catalogue_rdf
data set: Subpopulations
source: OncoLifeS
resource: OncoLifeS
title: OncoLifeS Hereditary Breast and Ovarian Cancer
name: OncoLifeS Hereditary Breast and Ovarian Cancer
pid: https://umcgresearchdatacatalogue.nl/all/collections/OncoLifeS/subpopulations/OncoLifeS%20Hereditary%20Breast%20and%20Ovarian%20Cancer
description: Patients with A “mutation,” or harmful genetic change, in either BRCA1 or BRCA2 gives a woman an increased lifetime risk of developing breast and ovarian cancers.
keyword: Oncology Surgery
keywords: Oncology Surgery
keyword: Biomaterial processing
keywords: Biomaterial processing
keyword: Dermatological cancer
keywords: Dermatological cancer
keyword: Long-term outcome data
keywords: Long-term outcome data
keyword: Patient characteristics
keywords: Patient characteristics
keyword: Quality of life data
keywords: Quality of life data
keyword: lung oncology
keywords: lung oncology
keyword: Patient reported data
keywords: Patient reported data
keyword: Treatment response
keywords: Treatment response
keyword: Cancer Research Centre
keywords: Cancer Research Centre
keyword: Adolescents and young adults with cancer
keywords: Adolescents and young adults with cancer
keyword: Hereditary increased risk of breast and ovarian cancer
keywords: Hereditary increased risk of breast and ovarian cancer
keyword: Neuroendocrine tumors
keywords: Neuroendocrine tumors
keyword: Imaging data
keywords: Imaging data
keyword: Dutch Trial Register
keywords: Dutch Trial Register
keyword: gynecological oncology
keywords: gynecological oncology
keyword: Quality of care
keywords: Quality of care
keyword: Quality of life
keywords: Quality of life
keyword: European reference network on rare cancers (EURACAN)
keywords: European reference network on rare cancers (EURACAN)
keyword: Translational research
keywords: Translational research
keyword: Patient-reported data
keywords: Patient-reported data
keyword: Testicular germ-cell tumors
keywords: Testicular germ-cell tumors
keyword: Breast cancer
keywords: Breast cancer
keyword: cancer patient
keywords: cancer patient
keyword: Tumor working groups
keywords: Tumor working groups
keyword: Data protection
keywords: Data protection
keyword: Longitudinal
keywords: Longitudinal
keyword: Data collection
keywords: Data collection
keyword: Age-related disease
keywords: Age-related disease
keyword: Sarcoma
keywords: Sarcoma
keyword: Imaging data handling
keywords: Imaging data handling
keyword: Bone and soft tissue cancer
keywords: Bone and soft tissue cancer
keyword: Routine clinical care
keywords: Routine clinical care
keyword: Hematologic Cancer
keywords: Hematologic Cancer
keyword: Rare tumors

OncoLifeS OncoLifeS Lung oncology
type: Subpopulations
type: Observation
endpoint URL: catalogue_rdf
data set: Subpopulations
source: OncoLifeS
resource: OncoLifeS
title: OncoLifeS Lung oncology
name: OncoLifeS Lung oncology
pid: https://umcgresearchdatacatalogue.nl/all/collections/OncoLifeS/subpopulations/OncoLifeS%20Lung%20oncology
description: Type of cancer starts in the lungs.
keyword: Oncology Surgery
keywords: Oncology Surgery
keyword: Biomaterial processing
keywords: Biomaterial processing
keyword: Dermatological cancer
keywords: Dermatological cancer
keyword: Long-term outcome data
keywords: Long-term outcome data
keyword: Patient characteristics
keywords: Patient characteristics
keyword: Quality of life data
keywords: Quality of life data
keyword: lung oncology
keywords: lung oncology
keyword: Patient reported data
keywords: Patient reported data
keyword: Treatment response
keywords: Treatment response
keyword: Cancer Research Centre
keywords: Cancer Research Centre
keyword: Adolescents and young adults with cancer
keywords: Adolescents and young adults with cancer
keyword: Hereditary increased risk of breast and ovarian cancer
keywords: Hereditary increased risk of breast and ovarian cancer
keyword: Neuroendocrine tumors
keywords: Neuroendocrine tumors
keyword: Imaging data
keywords: Imaging data
keyword: Dutch Trial Register
keywords: Dutch Trial Register
keyword: gynecological oncology
keywords: gynecological oncology
keyword: Quality of care
keywords: Quality of care
keyword: Quality of life
keywords: Quality of life
keyword: European reference network on rare cancers (EURACAN)
keywords: European reference network on rare cancers (EURACAN)
keyword: Translational research
keywords: Translational research
keyword: Patient-reported data
keywords: Patient-reported data
keyword: Testicular germ-cell tumors
keywords: Testicular germ-cell tumors
keyword: Breast cancer
keywords: Breast cancer
keyword: cancer patient
keywords: cancer patient
keyword: Tumor working groups
keywords: Tumor working groups
keyword: Data protection
keywords: Data protection
keyword: Longitudinal
keywords: Longitudinal
keyword: Data collection
keywords: Data collection
keyword: Age-related disease
keywords: Age-related disease
keyword: Sarcoma
keywords: Sarcoma
keyword: Imaging data handling
keywords: Imaging data handling
keyword: Bone and soft tissue cancer
keywords: Bone and soft tissue cancer
keyword: Routine clinical care
keywords: Routine clinical care
keyword: Hematologic Cancer
keywords: Hematologic Cancer
keyword: Rare tumors

OncoLifeS OncoLifeS Head&Neck cancer
type: Subpopulations
type: Observation
endpoint URL: catalogue_rdf
data set: Subpopulations
source: OncoLifeS
resource: OncoLifeS
title: OncoLifeS Head&Neck cancer
name: OncoLifeS Head&Neck cancer
pid: https://umcgresearchdatacatalogue.nl/all/collections/OncoLifeS/subpopulations/OncoLifeS%20Head&Neck%20cancer
description: Include cancers in the larynx, throat, lips, mouth, nose and salivary glands.
keyword: Oncology Surgery
keywords: Oncology Surgery
keyword: Biomaterial processing
keywords: Biomaterial processing
keyword: Dermatological cancer
keywords: Dermatological cancer
keyword: Long-term outcome data
keywords: Long-term outcome data
keyword: Patient characteristics
keywords: Patient characteristics
keyword: Quality of life data
keywords: Quality of life data
keyword: lung oncology
keywords: lung oncology
keyword: Patient reported data
keywords: Patient reported data
keyword: Treatment response
keywords: Treatment response
keyword: Cancer Research Centre
keywords: Cancer Research Centre
keyword: Adolescents and young adults with cancer
keywords: Adolescents and young adults with cancer
keyword: Hereditary increased risk of breast and ovarian cancer
keywords: Hereditary increased risk of breast and ovarian cancer
keyword: Neuroendocrine tumors
keywords: Neuroendocrine tumors
keyword: Imaging data
keywords: Imaging data
keyword: Dutch Trial Register
keywords: Dutch Trial Register
keyword: gynecological oncology
keywords: gynecological oncology
keyword: Quality of care
keywords: Quality of care
keyword: Quality of life
keywords: Quality of life
keyword: European reference network on rare cancers (EURACAN)
keywords: European reference network on rare cancers (EURACAN)
keyword: Translational research
keywords: Translational research
keyword: Patient-reported data
keywords: Patient-reported data
keyword: Testicular germ-cell tumors
keywords: Testicular germ-cell tumors
keyword: Breast cancer
keywords: Breast cancer
keyword: cancer patient
keywords: cancer patient
keyword: Tumor working groups
keywords: Tumor working groups
keyword: Data protection
keywords: Data protection
keyword: Longitudinal
keywords: Longitudinal
keyword: Data collection
keywords: Data collection
keyword: Age-related disease
keywords: Age-related disease
keyword: Sarcoma
keywords: Sarcoma
keyword: Imaging data handling
keywords: Imaging data handling
keyword: Bone and soft tissue cancer
keywords: Bone and soft tissue cancer
keyword: Routine clinical care
keywords: Routine clinical care
keyword: Hematologic Cancer
keywords: Hematologic Cancer
keyword: Rare tumors

AcuteLines AcuteLines Category A
type: Subpopulations
type: Observation
endpoint URL: catalogue_rdf
data set: Subpopulations
source: AcuteLines
resource: AcuteLines
title: AcuteLines Category A
name: AcuteLines Category A
pid: https://umcgresearchdatacatalogue.nl/all/collections/AcuteLines/subpopulations/AcuteLines%20Category%20A
description: Patients that arrive through the emergency department with where medical data will be available for reuse, and extra data and biomaterials will be collected for future research.
keyword: Emergencies
keywords: Emergencies
keyword: ECG
keywords: ECG
keyword: Acute Illness
keywords: Acute Illness
keyword: Metabolism
keywords: Metabolism
keyword: Precision Medicine
keywords: Precision Medicine
keyword: Skin Infection
keywords: Skin Infection
keyword: Urinary Tract Infections
keywords: Urinary Tract Infections
keyword: Hemorrhage
keywords: Hemorrhage
keyword: Microbiology
keywords: Microbiology
keyword: Acute Care
keywords: Acute Care
keyword: Emergency Medicine
keywords: Emergency Medicine
keyword: Shock
keywords: Shock
keyword: Internal Medicine
keywords: Internal Medicine
keyword: Rehospitalization
keywords: Rehospitalization
keyword: Illness Prediction
keywords: Illness Prediction
keyword: Acutelines
keywords: Acutelines
keyword: Urine
keywords: Urine
keyword: Acute Medicine
keywords: Acute Medicine
keyword: RNA
keywords: RNA
keyword: Virology
keywords: Virology
keyword: Intoxication By Drug
keywords: Intoxication By Drug
keyword: PAXGene
keywords: PAXGene
keyword: Transcriptomics
keywords: Transcriptomics
keyword: Septic Shock
keywords: Septic Shock
keyword: Proteome
keywords: Proteome
keyword: Quality Of Life
keywords: Quality Of Life
keyword: Easures
keywords: Easures
keyword: Personalized Medicine
keywords: Personalized Medicine
keyword: Genomics
keywords: Genomics
keyword: Patient Reported Outcome Measures
keywords: Patient Reported Outcome Measures
keyword: Microbiome
keywords: Microbiome
keyword: Polypharmacy
keywords: Polypharmacy
keyword: Patient Reported Evaluation Measures
keywords: Patient Reported Evaluation Measures
keyword: Emergency Department
keywords: Emergency Department
keyword: PPG

AcuteLines AcuteLines Category C
type: Subpopulations
type: Observation
endpoint URL: catalogue_rdf
data set: Subpopulations
source: AcuteLines
resource: AcuteLines
title: AcuteLines Category C
name: AcuteLines Category C
pid: https://umcgresearchdatacatalogue.nl/all/collections/AcuteLines/subpopulations/AcuteLines%20Category%20C
description: Patients that arrive through the emergency department where medical data will be available for reuse
keyword: Emergencies
keywords: Emergencies
keyword: ECG
keywords: ECG
keyword: Acute Illness
keywords: Acute Illness
keyword: Metabolism
keywords: Metabolism
keyword: Precision Medicine
keywords: Precision Medicine
keyword: Skin Infection
keywords: Skin Infection
keyword: Urinary Tract Infections
keywords: Urinary Tract Infections
keyword: Hemorrhage
keywords: Hemorrhage
keyword: Microbiology
keywords: Microbiology
keyword: Acute Care
keywords: Acute Care
keyword: Emergency Medicine
keywords: Emergency Medicine
keyword: Shock
keywords: Shock
keyword: Internal Medicine
keywords: Internal Medicine
keyword: Rehospitalization
keywords: Rehospitalization
keyword: Illness Prediction
keywords: Illness Prediction
keyword: Acutelines
keywords: Acutelines
keyword: Urine
keywords: Urine
keyword: Acute Medicine
keywords: Acute Medicine
keyword: RNA
keywords: RNA
keyword: Virology
keywords: Virology
keyword: Intoxication By Drug
keywords: Intoxication By Drug
keyword: PAXGene
keywords: PAXGene
keyword: Transcriptomics
keywords: Transcriptomics
keyword: Septic Shock
keywords: Septic Shock
keyword: Proteome
keywords: Proteome
keyword: Quality Of Life
keywords: Quality Of Life
keyword: Easures
keywords: Easures
keyword: Personalized Medicine
keywords: Personalized Medicine
keyword: Genomics
keywords: Genomics
keyword: Patient Reported Outcome Measures
keywords: Patient Reported Outcome Measures
keyword: Microbiome
keywords: Microbiome
keyword: Polypharmacy
keywords: Polypharmacy
keyword: Patient Reported Evaluation Measures
keywords: Patient Reported Evaluation Measures
keyword: Emergency Department
keywords: Emergency Department
keyword: PPG

AcuteLines AcuteLines Category B
type: Subpopulations
type: Observation
endpoint URL: catalogue_rdf
data set: Subpopulations
source: AcuteLines
resource: AcuteLines
title: AcuteLines Category B
name: AcuteLines Category B
pid: https://umcgresearchdatacatalogue.nl/all/collections/AcuteLines/subpopulations/AcuteLines%20Category%20B
description: Patients that arrive through the emergency department with where medical data will be available for reuse and extra will be collected for future research.
keyword: Emergencies
keywords: Emergencies
keyword: ECG
keywords: ECG
keyword: Acute Illness
keywords: Acute Illness
keyword: Metabolism
keywords: Metabolism
keyword: Precision Medicine
keywords: Precision Medicine
keyword: Skin Infection
keywords: Skin Infection
keyword: Urinary Tract Infections
keywords: Urinary Tract Infections
keyword: Hemorrhage
keywords: Hemorrhage
keyword: Microbiology
keywords: Microbiology
keyword: Acute Care
keywords: Acute Care
keyword: Emergency Medicine
keywords: Emergency Medicine
keyword: Shock
keywords: Shock
keyword: Internal Medicine
keywords: Internal Medicine
keyword: Rehospitalization
keywords: Rehospitalization
keyword: Illness Prediction
keywords: Illness Prediction
keyword: Acutelines
keywords: Acutelines
keyword: Urine
keywords: Urine
keyword: Acute Medicine
keywords: Acute Medicine
keyword: RNA
keywords: RNA
keyword: Virology
keywords: Virology
keyword: Intoxication By Drug
keywords: Intoxication By Drug
keyword: PAXGene
keywords: PAXGene
keyword: Transcriptomics
keywords: Transcriptomics
keyword: Septic Shock
keywords: Septic Shock
keyword: Proteome
keywords: Proteome
keyword: Quality Of Life
keywords: Quality Of Life
keyword: Easures
keywords: Easures
keyword: Personalized Medicine
keywords: Personalized Medicine
keyword: Genomics
keywords: Genomics
keyword: Patient Reported Outcome Measures
keywords: Patient Reported Outcome Measures
keyword: Microbiome
keywords: Microbiome
keyword: Polypharmacy
keywords: Polypharmacy
keyword: Patient Reported Evaluation Measures
keywords: Patient Reported Evaluation Measures
keyword: Emergency Department
keywords: Emergency Department
keyword: PPG

PSI IBD PSI IBD
type: Subpopulations
type: Observation
endpoint URL: catalogue_rdf
data set: Subpopulations
source: PSI IBD
resource: PSI IBD
title: PSI IBD
name: PSI IBD
pid: https://umcgresearchdatacatalogue.nl/all/collections/PSI%20IBD/subpopulations/PSI%20IBD
description: National biobank to facilitate clinically relevant multi-omics research in patients with IBD. Inflammatory Bowel Diseases (IBD) are diseases characterized by inflammation of the gastrointestinal tract, including Crohn’s disease and ulcerative colitis. Its prevalence is rising, affecting approximately 100.000 persons in the Netherland alone. Its cause is multifactorial, involving a complex interplay between host genetics, environmental factors including the diet and dysregulated immune responses towards the gut microbiome Our aims - To further knowledge of the complex etiology of development and course of IBD - To search for predictors of treatment response - To use multi-omics data research of large groups of patients and translate its findings to personalized treatment of individual patients
keyword: IBD Crohn's disease
keywords: IBD Crohn's disease
keyword: Genome
keywords: Genome
keyword: Exposome
keywords: Exposome
keyword: Multiomics
keywords: Multiomics
keyword: Ulcerative colitis
keywords: Ulcerative colitis
keyword: Microbiome
keywords: Microbiome
keyword: IBD-undetermined
keywords: IBD-undetermined
keyword: Inflammatory Bowel Disease
keywords: Inflammatory Bowel Disease
number of unique individuals: 1200
number of participants: 1200
start date: 2009
inclusion start: 2009
age groups: http://umcgresearchdatacatalogue.nl/CatalogueOntologies/api/rdf/AgeGroups/name=Aged%20%2880%2B%20years%29
age groups: http://umcgresearchdatacatalogue.nl/CatalogueOntologies/api/rdf/AgeGroups/name=Aged%20%2865%2B%20years%29
age groups: http://umcgresearchdatacatalogue.nl/CatalogueOntologies/api/rdf/AgeGroups/name=Middle-aged%20%2845-64%20years%29
age groups: http://umcgresearchdatacatalogue.nl/CatalogueOntologies/api/rdf/AgeGroups/name=Adult%20%2818%2B%20years%29
age groups: http://umcgresearchdatacatalogue.nl/CatalogueOntologies/api/rdf/AgeGroups/name=Young%20adult%20%2818-24%20years%29
age groups: http://umcgresearchdatacatalogue.nl/CatalogueOntologies/api/rdf/AgeGroups/name=Adult%20%2825-44%20years%29
age groups: http://umcgresearchdatacatalogue.nl/CatalogueOntologies/api/rdf/AgeGroups/name=Aged%20%2865-79%20years%29
countries: http://umcgresearchdatacatalogue.nl/CatalogueOntologies/api/rdf/Countries/name=Netherlands%20%28the%29
spatial: NLD
contact point: PSI IBD Kim Sloot
publisher: PSI IBD UMCG
creator: PSI IBD ICC
creator: PSI IBD UMCG
creator: PSI IBD HealthRI
theme: http://umcgresearchdatacatalogue.nl/CatalogueOntologies/api/rdf/Themes/name=Health
theme: HEAL
access rights: http://umcgresearchdatacatalogue.nl/CatalogueOntologies/api/rdf/AccessRights/name=Non%20public
access rights: NON PUBLIC
applicable legislation: http://umcgresearchdatacatalogue.nl/CatalogueOntologies/api/rdf/Legislations/name=Data%20Governance%20Act
applicable legislation: oj
mg_draft: false
mg_insertedOn: 2026-05-13T12:02:10
mg_updatedOn: 2026-05-13T12:02:10

UMCG MOLGENIS
type: Agents
type: Observation
type: Agent
type: Organization
endpoint URL: catalogue_rdf
data set: Agents
resource: UMCG
id: MOLGENIS
type: http://umcgresearchdatacatalogue.nl/CatalogueOntologies/api/rdf/AgentTypes/name=Organisation
name: University Medical Center Groningen
organisation name: University Medical Center Groningen
organisation pid: https://ror.org/03cv38k47
organisation website: www.umcg.nl
mg_draft: false
mg_insertedOn: 2026-05-13T12:02:11
mg_updatedOn: 2026-05-13T12:02:11
mg_tableclass: catalogue_rdf.Agents

LIFELINES_NEXT LIFELINES_NEXT P18
type: Collection events
type: Observation
endpoint URL: catalogue_rdf
data set: Collection events
source: LIFELINES_NEXT
resource: LIFELINES_NEXT
title: LIFELINES_NEXT P18
name: LIFELINES_NEXT P18
pid: https://umcgresearchdatacatalogue.nl/all/collections/LIFELINES_NEXT/collection-events/LIFELINES_NEXT%20P18
description: Data collection at gestational age of 18 weeks
source: LIFELINES_NEXT LIFELINES_NEXT Mothers
subpopulations: LIFELINES_NEXT LIFELINES_NEXT Mothers
keyword: Breast milk
keywords: Breast milk
keyword: Development
keywords: Development
keyword: Urine
keywords: Urine
keyword: Blood
keywords: Blood
keyword: Cord blood
keywords: Cord blood
keyword: Healthy ageing
keywords: Healthy ageing
keyword: Birth cohort
keywords: Birth cohort
keyword: Transgenerational effects
keywords: Transgenerational effects
keyword: Meconium
keywords: Meconium
keyword: Microbiome
keywords: Microbiome
keyword: Biobank
keywords: Biobank
keyword: Feces
keywords: Feces
start date: 2016-01-01
age groups: http://umcgresearchdatacatalogue.nl/CatalogueOntologies/api/rdf/AgeGroups/name=Young%20adult%20%2818-24%20years%29
age groups: http://umcgresearchdatacatalogue.nl/CatalogueOntologies/api/rdf/AgeGroups/name=Middle-aged%20%2845-64%20years%29
age groups: http://umcgresearchdatacatalogue.nl/CatalogueOntologies/api/rdf/AgeGroups/name=Adult%20%2825-44%20years%29
number of participants: 1450
areas of information: http://umcgresearchdatacatalogue.nl/CatalogueOntologies/api/rdf/AreasOfInformationCohorts/name=Income%2C%20possessions%2C%20and%20benefits
areas of information: http://umcgresearchdatacatalogue.nl/CatalogueOntologies/api/rdf/AreasOfInformationCohorts/name=Education
areas of information: http://umcgresearchdatacatalogue.nl/CatalogueOntologies/api/rdf/AreasOfInformationCohorts/name=Medication%20and%20supplement%20intake
areas of information: http://umcgresearchdatacatalogue.nl/CatalogueOntologies/api/rdf/AreasOfInformationCohorts/name=Contraception
areas of information: http://umcgresearchdatacatalogue.nl/CatalogueOntologies/api/rdf/AreasOfInformationCohorts/name=Alcohol
areas of information: http://umcgresearchdatacatalogue.nl/CatalogueOntologies/api/rdf/AreasOfInformationCohorts/name=Pregnancy%2C%20delivery%20and%20birth
areas of information: http://umcgresearchdatacatalogue.nl/CatalogueOntologies/api/rdf/AreasOfInformationCohorts/name=Tobacco
areas of information: http://umcgresearchdatacatalogue.nl/CatalogueOntologies/api/rdf/AreasOfInformationCohorts/name=Questionnaire%20and%20interview-related%20information
areas of information: http://umcgresearchdatacatalogue.nl/CatalogueOntologies/api/rdf/AreasOfInformationCohorts/name=Drugs
areas of information: http://umcgresearchdatacatalogue.nl/CatalogueOntologies/api/rdf/AreasOfInformationCohorts/name=Fertility%20and%20sexual%20health
areas of information: http://umcgresearchdatacatalogue.nl/CatalogueOntologies/api/rdf/AreasOfInformationCohorts/name=Puberty%2C%20menstruation%2C%20menopause%20and%20andropause
areas of information: http://umcgresearchdatacatalogue.nl/CatalogueOntologies/api/rdf/AreasOfInformationCohorts/name=Sexual%20behaviours%20and%20orientation
data categories: http://umcgresearchdatacatalogue.nl/CatalogueOntologies/api/rdf/DataCategories/name=Survey%20data
standardized tools other: Reproductive Origins of Adult Health and Disease (ROAHD)
core variables: Smoking
contact point: LIFELINES_NEXT Lifelines NEXT Contact
publisher: LIFELINES_NEXT UMCG
creator: LIFELINES_NEXT UMCG
theme: http://umcgresearchdatacatalogue.nl/CatalogueOntologies/api/rdf/Themes/name=Health
theme: HEAL
access rights: http://umcgresearchdatacatalogue.nl/CatalogueOntologies/api/rdf/AccessRights/name=Non%20public
access rights: NON PUBLIC
applicable legislation: http://umcgresearchdatacatalogue.nl/CatalogueOntologies/api/rdf/Legislations/name=Data%20Governance%20Act
applicable legislation: oj
mg_draft: false
mg_insertedOn: 2026-05-13T12:02:11
mg_updatedOn: 2026-05-13T12:02:11

EGAS00001002169 EGAS00001002169 MeDALL epigenetics data
type: Collection events
type: Observation
endpoint URL: catalogue_rdf
data set: Collection events
source: EGAS00001002169
resource: EGAS00001002169
title: EGAS00001002169 MeDALL epigenetics data
name: EGAS00001002169 MeDALL epigenetics data
pid: https://ega-archive.org/datasets/EGAD00010001455
description: illumina 450K
keyword: allergy
keywords: allergy
keyword: epigenetics
keywords: epigenetics
number of participants: 1347
data categories: http://umcgresearchdatacatalogue.nl/CatalogueOntologies/api/rdf/DataCategories/name=Genomics
standardized tools other: 450K
publisher: EGAS00001002169 UMCG
creator: EGAS00001002169 UMCG
theme: http://umcgresearchdatacatalogue.nl/CatalogueOntologies/api/rdf/Themes/name=Health
theme: HEAL
access rights: http://umcgresearchdatacatalogue.nl/CatalogueOntologies/api/rdf/AccessRights/name=Non%20public
access rights: NON PUBLIC
applicable legislation: http://umcgresearchdatacatalogue.nl/CatalogueOntologies/api/rdf/Legislations/name=Data%20Governance%20Act
applicable legislation: oj
mg_draft: false
mg_insertedOn: 2026-05-13T12:02:11
mg_updatedOn: 2026-05-13T12:02:11

EGAS00001002560 EGAS00001002560 LLDeep DAG2+: scRNA-seq in PBMCs
type: Collection events
type: Observation
endpoint URL: catalogue_rdf
data set: Collection events
source: EGAS00001002560
resource: EGAS00001002560
title: EGAS00001002560 LLDeep DAG2+: scRNA-seq in PBMCs
name: EGAS00001002560 LLDeep DAG2+: scRNA-seq in PBMCs
pid: https://ega-archive.org/datasets/EGAD00001003459
description: Single cell transcriptomics of PBMCs of 47 donors from the Lifelines Deep cohort (general population, Northern part of the Netherlands). Cells of five or six different donors were pooled together in one sample pool, resulting in eight different sample pools. In total, 28.855 cells were captured and their transcriptomes were sequenced to an average depth of 74k. Genotype data was available for each donor, which allowed us to use the Demuxlet method that uses variable SNPs between the pooled individuals to determine which cell belongs to which individual. Since genotype information is lacking of 2 individuals, the transcriptome of only 45 individuals could be retrieved.
keyword: single cell transcriptomics
keywords: single cell transcriptomics
keyword: Lifelines Deep
keywords: Lifelines Deep
number of participants: 8
data categories: http://umcgresearchdatacatalogue.nl/CatalogueOntologies/api/rdf/DataCategories/name=Transcriptomics
data categories: http://umcgresearchdatacatalogue.nl/CatalogueOntologies/api/rdf/DataCategories/name=Genomics
standardized tools other: Illumina HiSeq 4000
contact point: EGAS00001002560 Monique van der Wijst
publisher: EGAS00001002560 UMCG
creator: EGAS00001002560 UMCG
theme: http://umcgresearchdatacatalogue.nl/CatalogueOntologies/api/rdf/Themes/name=Health
theme: HEAL
access rights: http://umcgresearchdatacatalogue.nl/CatalogueOntologies/api/rdf/AccessRights/name=Non%20public
access rights: NON PUBLIC
applicable legislation: http://umcgresearchdatacatalogue.nl/CatalogueOntologies/api/rdf/Legislations/name=Data%20Governance%20Act
applicable legislation: oj
mg_draft: false
mg_insertedOn: 2026-05-13T12:02:11
mg_updatedOn: 2026-05-13T12:02:11

EGAS00001002560 EGAS00001002560 LLDeep DAG2+ scRNA-seq in PBMCs
type: Collection events
type: Observation
endpoint URL: catalogue_rdf
data set: Collection events
source: EGAS00001002560
resource: EGAS00001002560
title: EGAS00001002560 LLDeep DAG2+ scRNA-seq in PBMCs
name: EGAS00001002560 LLDeep DAG2+ scRNA-seq in PBMCs
pid: https://ega-archive.org/datasets/EGAD00010001315
description: Single cell transcriptomics of PBMCs of 47 donors from the Lifelines Deep cohort (general population, Northern part of the Netherlands). Cells of five or six different donors were pooled together in one sample pool, resulting in eight different sample pools. In total, 28.855 cells were captured and their transcriptomes were sequenced to an average depth of 74k. Genotype data was available for each donor, which allowed us to use the Demuxlet method that uses variable SNPs between the pooled individuals to determine which cell belongs to which individual. Since genotype information is lacking of 2 individuals, the transcriptome of only 45 individuals could be retrieved.
keyword: single cell transcriptomics
keywords: single cell transcriptomics
keyword: PMBCs
keywords: PMBCs
keyword: Lifelines Deep
keywords: Lifelines Deep
number of participants: 45
data categories: http://umcgresearchdatacatalogue.nl/CatalogueOntologies/api/rdf/DataCategories/name=Transcriptomics
data categories: http://umcgresearchdatacatalogue.nl/CatalogueOntologies/api/rdf/DataCategories/name=Genomics
standardized tools other: Illumina HiSeq4000
contact point: EGAS00001002560 Monique van der Wijst
publisher: EGAS00001002560 UMCG
creator: EGAS00001002560 UMCG
theme: http://umcgresearchdatacatalogue.nl/CatalogueOntologies/api/rdf/Themes/name=Health
theme: HEAL
access rights: http://umcgresearchdatacatalogue.nl/CatalogueOntologies/api/rdf/AccessRights/name=Non%20public
access rights: NON PUBLIC
applicable legislation: http://umcgresearchdatacatalogue.nl/CatalogueOntologies/api/rdf/Legislations/name=Data%20Governance%20Act
applicable legislation: oj
mg_draft: false
mg_insertedOn: 2026-05-13T12:02:11
mg_updatedOn: 2026-05-13T12:02:11

LIFELINES_NEXT LIFELINES_NEXT M2
type: Collection events
type: Observation
endpoint URL: catalogue_rdf
data set: Collection events
source: LIFELINES_NEXT
resource: LIFELINES_NEXT
title: LIFELINES_NEXT M2
name: LIFELINES_NEXT M2
pid: https://umcgresearch2atacatalogue.nl/all/collections/LIFELINES_NEXT/collection-events/LIFELINES_NEXT%20M1
description: Data collection at infant's age of 2 months
source: LIFELINES_NEXT LIFELINES_NEXT Mothers
subpopulations: LIFELINES_NEXT LIFELINES_NEXT Mothers
source: LIFELINES_NEXT LIFELINES_NEXT Children
subpopulations: LIFELINES_NEXT LIFELINES_NEXT Children
keyword: Breast milk
keywords: Breast milk
keyword: Development
keywords: Development
keyword: Urine
keywords: Urine
keyword: Blood
keywords: Blood
keyword: Cord blood
keywords: Cord blood
keyword: Healthy ageing
keywords: Healthy ageing
keyword: Birth cohort
keywords: Birth cohort
keyword: Transgenerational effects
keywords: Transgenerational effects
keyword: Meconium
keywords: Meconium
keyword: Microbiome
keywords: Microbiome
keyword: Biobank
keywords: Biobank
keyword: Feces
keywords: Feces
start date: 2017-01-01
age groups: http://umcgresearchdatacatalogue.nl/CatalogueOntologies/api/rdf/AgeGroups/name=Young%20adult%20%2818-24%20years%29
age groups: http://umcgresearchdatacatalogue.nl/CatalogueOntologies/api/rdf/AgeGroups/name=Middle-aged%20%2845-64%20years%29
age groups: http://umcgresearchdatacatalogue.nl/CatalogueOntologies/api/rdf/AgeGroups/name=Adult%20%2825-44%20years%29
age groups: http://umcgresearchdatacatalogue.nl/CatalogueOntologies/api/rdf/AgeGroups/name=Infants%20and%20toddlers%20%282-23%20months%29
number of participants: 1450
areas of information: http://umcgresearchdatacatalogue.nl/CatalogueOntologies/api/rdf/AreasOfInformationCohorts/name=Nutrition
areas of information: http://umcgresearchdatacatalogue.nl/CatalogueOntologies/api/rdf/AreasOfInformationCohorts/name=Psychological%20distress%20and%20emotions
areas of information: http://umcgresearchdatacatalogue.nl/CatalogueOntologies/api/rdf/AreasOfInformationCohorts/name=Perception%20of%20health
areas of information: http://umcgresearchdatacatalogue.nl/CatalogueOntologies/api/rdf/AreasOfInformationCohorts/name=Questionnaire%20and%20interview-related%20information
areas of information: http://umcgresearchdatacatalogue.nl/CatalogueOntologies/api/rdf/AreasOfInformationCohorts/name=Medication%20and%20supplement%20intake
areas of information: http://umcgresearchdatacatalogue.nl/CatalogueOntologies/api/rdf/AreasOfInformationCohorts/name=Microbiology
areas of information: http://umcgresearchdatacatalogue.nl/CatalogueOntologies/api/rdf/AreasOfInformationCohorts/name=Genomics
data categories: http://umcgresearchdatacatalogue.nl/CatalogueOntologies/api/rdf/DataCategories/name=Genomics
data categories: http://umcgresearchdatacatalogue.nl/CatalogueOntologies/api/rdf/DataCategories/name=Biological%20samples
data categories: http://umcgresearchdatacatalogue.nl/CatalogueOntologies/api/rdf/DataCategories/name=Survey%20data
sample categories: http://umcgresearchdatacatalogue.nl/CatalogueOntologies/api/rdf/SampleCategories/name=Milk%2C%20Human
sample categories: http://umcgresearchdatacatalogue.nl/CatalogueOntologies/api/rdf/SampleCategories/name=Feces
standardized tools: http://umcgresearchdatacatalogue.nl/CatalogueOntologies/api/rdf/StandardizedTools/name=Rome%20III%20IBS%20Diagnostic%20Questionnaire
standardized tools: http://umcgresearchdatacatalogue.nl/CatalogueOntologies/api/rdf/StandardizedTools/name=Food%20Frequency%20Questionnaire
standardized tools: http://umcgresearchdatacatalogue.nl/CatalogueOntologies/api/rdf/StandardizedTools/name=Edinburgh%20Postnatal%20%28Postpartum%29%20Depression%20Scale
standardized tools: http://umcgresearchdatacatalogue.nl/CatalogueOntologies/api/rdf/StandardizedTools/name=Parenting%20Stress%20Index
contact point: LIFELINES_NEXT Lifelines NEXT Contact
publisher: LIFELINES_NEXT UMCG
creator: LIFELINES_NEXT UMCG
theme: http://umcgresearchdatacatalogue.nl/CatalogueOntologies/api/rdf/Themes/name=Health
theme: HEAL
access rights: http://umcgresearchdatacatalogue.nl/CatalogueOntologies/api/rdf/AccessRights/name=Non%20public
access rights: NON PUBLIC
applicable legislation: http://umcgresearchdatacatalogue.nl/CatalogueOntologies/api/rdf/Legislations/name=Data%20Governance%20Act
applicable legislation: oj
mg_draft: false
mg_insertedOn: 2026-05-13T12:02:11
mg_updatedOn: 2026-05-13T12:02:11

LIFELINES_NEXT LIFELINES_NEXT M6
type: Collection events
type: Observation
endpoint URL: catalogue_rdf
data set: Collection events
source: LIFELINES_NEXT
resource: LIFELINES_NEXT
title: LIFELINES_NEXT M6
name: LIFELINES_NEXT M6
pid: https://umcgresearchdatacatalogue.nl/all/collections/LIFELINES_NEXT/collection-events/LIFELINES_NEXT%20M6
description: Data collection at infant's age of 6 months
source: LIFELINES_NEXT LIFELINES_NEXT Mothers
subpopulations: LIFELINES_NEXT LIFELINES_NEXT Mothers
source: LIFELINES_NEXT LIFELINES_NEXT Children
subpopulations: LIFELINES_NEXT LIFELINES_NEXT Children
keyword: Breast milk
keywords: Breast milk
keyword: Development
keywords: Development
keyword: Urine
keywords: Urine
keyword: Blood
keywords: Blood
keyword: Cord blood
keywords: Cord blood
keyword: Healthy ageing
keywords: Healthy ageing
keyword: Birth cohort
keywords: Birth cohort
keyword: Transgenerational effects
keywords: Transgenerational effects
keyword: Meconium
keywords: Meconium
keyword: Microbiome
keywords: Microbiome
keyword: Biobank
keywords: Biobank
keyword: Feces
keywords: Feces
start date: 2017-01-01
age groups: http://umcgresearchdatacatalogue.nl/CatalogueOntologies/api/rdf/AgeGroups/name=Young%20adult%20%2818-24%20years%29
age groups: http://umcgresearchdatacatalogue.nl/CatalogueOntologies/api/rdf/AgeGroups/name=Middle-aged%20%2845-64%20years%29
age groups: http://umcgresearchdatacatalogue.nl/CatalogueOntologies/api/rdf/AgeGroups/name=Adult%20%2825-44%20years%29
age groups: http://umcgresearchdatacatalogue.nl/CatalogueOntologies/api/rdf/AgeGroups/name=Infants%20and%20toddlers%20%282-23%20months%29
number of participants: 1450
areas of information: http://umcgresearchdatacatalogue.nl/CatalogueOntologies/api/rdf/AreasOfInformationCohorts/name=Life%20course%20development
areas of information: http://umcgresearchdatacatalogue.nl/CatalogueOntologies/api/rdf/AreasOfInformationCohorts/name=Microbiology
areas of information: http://umcgresearchdatacatalogue.nl/CatalogueOntologies/api/rdf/AreasOfInformationCohorts/name=Perception%20of%20health
areas of information: http://umcgresearchdatacatalogue.nl/CatalogueOntologies/api/rdf/AreasOfInformationCohorts/name=Psychological%20distress%20and%20emotions
areas of information: http://umcgresearchdatacatalogue.nl/CatalogueOntologies/api/rdf/AreasOfInformationCohorts/name=Questionnaire%20and%20interview-related%20information
areas of information: http://umcgresearchdatacatalogue.nl/CatalogueOntologies/api/rdf/AreasOfInformationCohorts/name=Genomics
areas of information: http://umcgresearchdatacatalogue.nl/CatalogueOntologies/api/rdf/AreasOfInformationCohorts/name=Breastfeeding
areas of information: http://umcgresearchdatacatalogue.nl/CatalogueOntologies/api/rdf/AreasOfInformationCohorts/name=Nutrition
areas of information: http://umcgresearchdatacatalogue.nl/CatalogueOntologies/api/rdf/AreasOfInformationCohorts/name=Medication%20and%20supplement%20intake
data categories: http://umcgresearchdatacatalogue.nl/CatalogueOntologies/api/rdf/DataCategories/name=Physiological%2FBiochemical%20measurements
data categories: http://umcgresearchdatacatalogue.nl/CatalogueOntologies/api/rdf/DataCategories/name=Biological%20samples
data categories: http://umcgresearchdatacatalogue.nl/CatalogueOntologies/api/rdf/DataCategories/name=Survey%20data
data categories: http://umcgresearchdatacatalogue.nl/CatalogueOntologies/api/rdf/DataCategories/name=Genomics
sample categories: http://umcgresearchdatacatalogue.nl/CatalogueOntologies/api/rdf/SampleCategories/name=Milk%2C%20Human
sample categories: http://umcgresearchdatacatalogue.nl/CatalogueOntologies/api/rdf/SampleCategories/name=Feces
standardized tools: http://umcgresearchdatacatalogue.nl/CatalogueOntologies/api/rdf/StandardizedTools/name=Brief%20Infant%20Sleep%20Questionnaire
standardized tools: http://umcgresearchdatacatalogue.nl/CatalogueOntologies/api/rdf/StandardizedTools/name=Infant%20Behavior%20Questionnaire
standardized tools: http://umcgresearchdatacatalogue.nl/CatalogueOntologies/api/rdf/StandardizedTools/name=Rome%20III%20IBS%20Diagnostic%20Questionnaire
standardized tools: http://umcgresearchdatacatalogue.nl/CatalogueOntologies/api/rdf/StandardizedTools/name=Food%20Frequency%20Questionnaire
standardized tools: http://umcgresearchdatacatalogue.nl/CatalogueOntologies/api/rdf/StandardizedTools/name=Parenting%20Stress%20Index
standardized tools: http://umcgresearchdatacatalogue.nl/CatalogueOntologies/api/rdf/StandardizedTools/name=Bayley%20Scales%20of%20Infant%20and%20Toddler%20Development
standardized tools: http://umcgresearchdatacatalogue.nl/CatalogueOntologies/api/rdf/StandardizedTools/name=Ages%20and%20Stages%20Questionnaire
contact point: LIFELINES_NEXT Lifelines NEXT Contact
publisher: LIFELINES_NEXT UMCG
creator: LIFELINES_NEXT UMCG
theme: http://umcgresearchdatacatalogue.nl/CatalogueOntologies/api/rdf/Themes/name=Health
theme: HEAL
access rights: http://umcgresearchdatacatalogue.nl/CatalogueOntologies/api/rdf/AccessRights/name=Non%20public
access rights: NON PUBLIC
applicable legislation: http://umcgresearchdatacatalogue.nl/CatalogueOntologies/api/rdf/Legislations/name=Data%20Governance%20Act
applicable legislation: oj
mg_draft: false
mg_insertedOn: 2026-05-13T12:02:11
mg_updatedOn: 2026-05-13T12:02:11

EGAS00001003735 EGAS00001003735 Gene expression by RNAseq in bronchial biopsies of asthmatics, asthma in remission and healthy subjects
type: Collection events
type: Observation
endpoint URL: catalogue_rdf
data set: Collection events
source: EGAS00001003735
resource: EGAS00001003735
title: EGAS00001003735 Gene expression by RNAseq in bronchial biopsies of asthmatics, asthma in remission and healthy subjects
name: EGAS00001003735 Gene expression by RNAseq in bronchial biopsies of asthmatics, asthma in remission and healthy subjects
pid: https://ega-archive.org/datasets/EGAD00001005112
description: The study focus was differential expression in bronchial biopsies between persistent asthma, asthma in remission and healthy controls using RNAseq. There were 184 samples that passed QC. RNA samples were processed using the TruSeq Stranded Total RNA Sample Preparation Kit (Illumina, San Diego, CA), using an automated procedure in a Caliper Sciclone NGS Workstation (PerkinElmer, Waltham, MA). In this procedure, all cytoplasmic and mitochondria rRNA was removed (RiboZero Gold kit). The obtained cDNA fragment libraries were loaded in pools of multiple samples unto an Illumina HiSeq2500 sequencer using default parameters for paired-end sequencing (2 × 100 bp). Data are available as 221 pairs of FASTQ-files. Note that several samples are associated with multiple sequence runs.
keyword: healthy controls
keywords: healthy controls
keyword: asthma
keywords: asthma
keyword: RNAseq
keywords: RNAseq
keyword: atshma in remission
keywords: atshma in remission
keyword: bronchial biopsies
keywords: bronchial biopsies
number of participants: 184
data categories: http://umcgresearchdatacatalogue.nl/CatalogueOntologies/api/rdf/DataCategories/name=Genomics
standardized tools other: Illumina HiSeq 2500
contact point: EGAS00001003735 Maarten van den Berge
publisher: EGAS00001003735 UMCG
creator: EGAS00001003735 UMCG
theme: http://umcgresearchdatacatalogue.nl/CatalogueOntologies/api/rdf/Themes/name=Health
theme: HEAL
access rights: http://umcgresearchdatacatalogue.nl/CatalogueOntologies/api/rdf/AccessRights/name=Non%20public
access rights: NON PUBLIC
applicable legislation: http://umcgresearchdatacatalogue.nl/CatalogueOntologies/api/rdf/Legislations/name=Data%20Governance%20Act
applicable legislation: oj
mg_draft: false
mg_insertedOn: 2026-05-13T12:02:11
mg_updatedOn: 2026-05-13T12:02:11

EGAS00001003739 EGAS00001003739 1506_Methylation_M.vd.Berge
type: Collection events
type: Observation
endpoint URL: catalogue_rdf
data set: Collection events
source: EGAS00001003739
resource: EGAS00001003739
title: EGAS00001003739 1506_Methylation_M.vd.Berge
name: EGAS00001003739 1506_Methylation_M.vd.Berge
pid: https://ega-archive.org/datasets/EGAD00010001731
description: DNA methylation in bronchial biopsies of asthmatics, asthma in remission and healthy subjects
keyword: methylation
keywords: methylation
keyword: asthma
keywords: asthma
number of participants: 179
data categories: http://umcgresearchdatacatalogue.nl/CatalogueOntologies/api/rdf/DataCategories/name=Genomics
standardized tools other: Infinium HumanMethylation450 BeadChip array (450k array)
contact point: EGAS00001003739 Maarten van den Berge
publisher: EGAS00001003739 UMCG
creator: EGAS00001003739 UMCG
theme: http://umcgresearchdatacatalogue.nl/CatalogueOntologies/api/rdf/Themes/name=Health
theme: HEAL
access rights: http://umcgresearchdatacatalogue.nl/CatalogueOntologies/api/rdf/AccessRights/name=Non%20public
access rights: NON PUBLIC
applicable legislation: http://umcgresearchdatacatalogue.nl/CatalogueOntologies/api/rdf/Legislations/name=Data%20Governance%20Act
applicable legislation: oj
mg_draft: false
mg_insertedOn: 2026-05-13T12:02:11
mg_updatedOn: 2026-05-13T12:02:11

EGAS00001004766 EGAS00001004766 Epigenome-wide association study of asthma remission in whole blood and nasal epithelium
type: Collection events
type: Observation
endpoint URL: catalogue_rdf
data set: Collection events
source: EGAS00001004766
resource: EGAS00001004766
title: EGAS00001004766 Epigenome-wide association study of asthma remission in whole blood and nasal epithelium
name: EGAS00001004766 Epigenome-wide association study of asthma remission in whole blood and nasal epithelium
pid: https://ega-archive.org/datasets/EGAD00010002026
description: Clinical remission (ClinR) was defined as the absence of asthma symptoms and medication for at least 12 months, and complete remission (ComR) was defined as ClinR with normal lung function and absence of airway hyperresponsiveness. We analyzed differential DNA methylation of ClinR and ComR comparing to persistent asthma (PersA) in whole blood samples (n=72) and nasal brushing samples (n=97) in a longitudinal cohort of well characterized asthma patients.
keyword: asthma in remission
keywords: asthma in remission
keyword: epigenetics
keywords: epigenetics
keyword: asthma
keywords: asthma
number of participants: 169
data categories: http://umcgresearchdatacatalogue.nl/CatalogueOntologies/api/rdf/DataCategories/name=Genomics
standardized tools other: Illumina 450K
publisher: EGAS00001004766 UMCG
creator: EGAS00001004766 UMCG
theme: http://umcgresearchdatacatalogue.nl/CatalogueOntologies/api/rdf/Themes/name=Health
theme: HEAL
access rights: http://umcgresearchdatacatalogue.nl/CatalogueOntologies/api/rdf/AccessRights/name=Non%20public
access rights: NON PUBLIC
applicable legislation: http://umcgresearchdatacatalogue.nl/CatalogueOntologies/api/rdf/Legislations/name=Data%20Governance%20Act
applicable legislation: oj
mg_draft: false
mg_insertedOn: 2026-05-13T12:02:11
mg_updatedOn: 2026-05-13T12:02:11

OncoLifeS OncoLifeS Follow-up 3 months
type: Collection events
type: Observation
endpoint URL: catalogue_rdf
data set: Collection events
source: OncoLifeS
resource: OncoLifeS
title: OncoLifeS Follow-up 3 months
name: OncoLifeS Follow-up 3 months
pid: https://umcgresearchdatacatalogue.nl/all/collections/OncoLifeS/collection-events/OncoLifeS%20Follow-up%203%20months
description: Questionnaire
source: OncoLifeS OncoLifeS Head&Neck cancer
subpopulations: OncoLifeS OncoLifeS Head&Neck cancer
keyword: Oncology Surgery
keywords: Oncology Surgery
keyword: Biomaterial processing
keywords: Biomaterial processing
keyword: Dermatological cancer
keywords: Dermatological cancer
keyword: Long-term outcome data
keywords: Long-term outcome data
keyword: Patient characteristics
keywords: Patient characteristics
keyword: Quality of life data
keywords: Quality of life data
keyword: lung oncology
keywords: lung oncology
keyword: Patient reported data
keywords: Patient reported data
keyword: Treatment response
keywords: Treatment response
keyword: Cancer Research Centre
keywords: Cancer Research Centre
keyword: Adolescents and young adults with cancer
keywords: Adolescents and young adults with cancer
keyword: Hereditary increased risk of breast and ovarian cancer
keywords: Hereditary increased risk of breast and ovarian cancer
keyword: Neuroendocrine tumors
keywords: Neuroendocrine tumors
keyword: Imaging data
keywords: Imaging data
keyword: Dutch Trial Register
keywords: Dutch Trial Register
keyword: gynecological oncology
keywords: gynecological oncology
keyword: Quality of care
keywords: Quality of care
keyword: Quality of life
keywords: Quality of life
keyword: European reference network on rare cancers (EURACAN)
keywords: European reference network on rare cancers (EURACAN)
keyword: Translational research
keywords: Translational research
keyword: Patient-reported data
keywords: Patient-reported data
keyword: Testicular germ-cell tumors
keywords: Testicular germ-cell tumors
keyword: Breast cancer
keywords: Breast cancer
keyword: cancer patient
keywords: cancer patient
keyword: Tumor working groups
keywords: Tumor working groups
keyword: Data protection
keywords: Data protection
keyword: Longitudinal
keywords: Longitudinal
keyword: Data collection
keywords: Data collection
keyword: Age-related disease
keywords: Age-related disease
keyword: Sarcoma
keywords: Sarcoma
keyword: Imaging data handling
keywords: Imaging data handling
keyword: Bone and soft tissue cancer
keywords: Bone and soft tissue cancer
keyword: Routine clinical care
keywords: Routine clinical care
keyword: Hematologic Cancer

EGAS00001000644 EGAS00001000644 GoNL release 5 raw SNV calls
type: Collection events
type: Observation
endpoint URL: catalogue_rdf
data set: Collection events
source: EGAS00001000644
resource: EGAS00001000644
title: EGAS00001000644 GoNL release 5 raw SNV calls
name: EGAS00001000644 GoNL release 5 raw SNV calls
pid: https://ega-archive.org/datasets/EGAD00001000743
description: These files contain a total of 20.4M SNVs and the complete information output by the GATK UnifiedGenotyper v1.4 on all 767 GoNL samples. These calls are not trio-aware and all genotypes were reported regardless of their quality. Both filtered and passing calls are reported in these files. Filtered calls include (1) calls failing our VQSR threshold and (2) calls in the GoNL inaccessible genome.
keyword: EGA
keywords: EGA
keyword: GoNL
keywords: GoNL
keyword: raw single nucleotide variants calls
keywords: raw single nucleotide variants calls
number of participants: 0
data categories: http://umcgresearchdatacatalogue.nl/CatalogueOntologies/api/rdf/DataCategories/name=Genomics
contact point: EGAS00001000644 Gert-Jan van de Geijn
publisher: EGAS00001000644 UMCG
creator: EGAS00001000644 UMCG
theme: http://umcgresearchdatacatalogue.nl/CatalogueOntologies/api/rdf/Themes/name=Health
theme: HEAL
access rights: http://umcgresearchdatacatalogue.nl/CatalogueOntologies/api/rdf/AccessRights/name=Non%20public
access rights: NON PUBLIC
applicable legislation: http://umcgresearchdatacatalogue.nl/CatalogueOntologies/api/rdf/Legislations/name=Data%20Governance%20Act
applicable legislation: oj
mg_insertedOn: 2026-05-13T12:02:11
mg_updatedOn: 2026-05-13T12:02:11

EGAS00001000644 EGAS00001000644 GoNL release 5 haplotype panel
type: Collection events
type: Observation
endpoint URL: catalogue_rdf
data set: Collection events
source: EGAS00001000644
resource: EGAS00001000644
title: EGAS00001000644 GoNL release 5 haplotype panel
name: EGAS00001000644 GoNL release 5 haplotype panel
pid: https://ega-archive.org/datasets/EGAD00001000744
description: The samples in this panel come from 250 families: 248 parents-child trios and 2 parent-child duos. As the children do not provide additional haplotypes or population information, they were excluded from the panel. The samples present in the release are composed of 248 couples, 2 single individuals and 1 sample composed from the 2 haplotypes from the duo's children transmitted by their missing parent. The composed sample is named gonl-220c_223c.The files contain a total of 18.9M SNVs and 1.1M INDELs in autosomal chromosomes. They were generated by phasing/imputing the SNVs (a) and INDELs (b) using MVNCall. Only sites passing filters are reported. Sites filtered as part of the GoNL inaccessible genome were kept (but flagged as filtered) and still may contain true positive calls but should be used with care as they are located in parts of the genome that are less well captured (systematic under or over-covered or low-mapping quality)
keyword: haplotype panel
keywords: haplotype panel
keyword: EGA
keywords: EGA
keyword: GoNL
keywords: GoNL
number of participants: 0
data categories: http://umcgresearchdatacatalogue.nl/CatalogueOntologies/api/rdf/DataCategories/name=Genomics
contact point: EGAS00001000644 Gert-Jan van de Geijn
publisher: EGAS00001000644 UMCG
creator: EGAS00001000644 UMCG
theme: http://umcgresearchdatacatalogue.nl/CatalogueOntologies/api/rdf/Themes/name=Health
theme: HEAL
access rights: http://umcgresearchdatacatalogue.nl/CatalogueOntologies/api/rdf/AccessRights/name=Non%20public
access rights: NON PUBLIC
applicable legislation: http://umcgresearchdatacatalogue.nl/CatalogueOntologies/api/rdf/Legislations/name=Data%20Governance%20Act
applicable legislation: oj
mg_insertedOn: 2026-05-13T12:02:11
mg_updatedOn: 2026-05-13T12:02:11

EGAS00001000644 EGAS00001000644 GoNL aligned sequence data in BAM format.
type: Collection events
type: Observation
endpoint URL: catalogue_rdf
data set: Collection events
source: EGAS00001000644
resource: EGAS00001000644
title: EGAS00001000644 GoNL aligned sequence data in BAM format.
name: EGAS00001000644 GoNL aligned sequence data in BAM format.
pid: https://ega-archive.org/datasets/EGAD00001001038
description: We mapped the data to the UCSC human reference genome build 37 using BWA 0.5.9-r16. We first mapped each read pair separately using bwa aln. Then we used bwa sampe to map the paired reads together to a BAM9 file. The BAM file was then sorted by genomic position and indexed using PicardTools-1.32 SortSam. To prevent PCR artifacts from influencing the downstream analysis of our data, we used Picard to mark the duplicate reads, which were ignored in downstream analysis. We used GATK IndelRealigner on our data around known indels (from 1KG Pilot). The IndelRealigner creates all possible read alignments using the source and computes the likelihood of the data containing the indel based on the read pileup. Whenever the maximum likelihood contains an indel, the reads are realigned accordingly. Each base is associated with a phred-scaled base quality score. Calibration of Phred scores is crucial as they are used in some of the downstream analysis models. We used GATK to recalibrate the base qualities with respect to (i) the base cycle, (ii) original quality score, and (iii) dinucleotide context. To minimize issues stemming from mapping problems around indels, we decided to undergo a second round of indel realignment using the GATK IndelRealigner by family rather than by individual. For this second round, we considered two sources of possible indels: 1KG Phase 1 indels and indels aligned by BWA in the GoNL data.
keyword: EGA
keywords: EGA
keyword: GoNL
keywords: GoNL
keyword: BAM format
keywords: BAM format
number of participants: 0
data categories: http://umcgresearchdatacatalogue.nl/CatalogueOntologies/api/rdf/DataCategories/name=Genomics
contact point: EGAS00001000644 Gert-Jan van de Geijn
publisher: EGAS00001000644 UMCG
creator: EGAS00001000644 UMCG
theme: http://umcgresearchdatacatalogue.nl/CatalogueOntologies/api/rdf/Themes/name=Health
theme: HEAL
access rights: http://umcgresearchdatacatalogue.nl/CatalogueOntologies/api/rdf/AccessRights/name=Non%20public
access rights: NON PUBLIC
applicable legislation: http://umcgresearchdatacatalogue.nl/CatalogueOntologies/api/rdf/Legislations/name=Data%20Governance%20Act
applicable legislation: oj
mg_insertedOn: 2026-05-13T12:02:11
mg_updatedOn: 2026-05-13T12:02:11

EGAS00001000644 EGAS00001000644 Set of Structural Variants and Indels for GoNL samples
type: Collection events
type: Observation
endpoint URL: catalogue_rdf
data set: Collection events
source: EGAS00001000644
resource: EGAS00001000644
title: EGAS00001000644 Set of Structural Variants and Indels for GoNL samples
name: EGAS00001000644 Set of Structural Variants and Indels for GoNL samples
pid: https://ega-archive.org/datasets/EGAD00001002261
description: These files contain indels and structural variants on 769 GoNL samples (SV release 6, 2016-05-25).
keyword: structural variants
keywords: structural variants
keyword: indels
keywords: indels
number of participants: 0
data categories: http://umcgresearchdatacatalogue.nl/CatalogueOntologies/api/rdf/DataCategories/name=Genomics
standardized tools other: Illumina HiSeq 2000;
contact point: EGAS00001000644 Gert-Jan van de Geijn
publisher: EGAS00001000644 UMCG
creator: EGAS00001000644 UMCG
theme: http://umcgresearchdatacatalogue.nl/CatalogueOntologies/api/rdf/Themes/name=Health
theme: HEAL
access rights: http://umcgresearchdatacatalogue.nl/CatalogueOntologies/api/rdf/AccessRights/name=Non%20public
access rights: NON PUBLIC
applicable legislation: http://umcgresearchdatacatalogue.nl/CatalogueOntologies/api/rdf/Legislations/name=Data%20Governance%20Act
applicable legislation: oj
mg_insertedOn: 2026-05-13T12:02:11
mg_updatedOn: 2026-05-13T12:02:11

EGAS00001003805 EGAS00001003805 CeD_Poland
type: Collection events
type: Observation
endpoint URL: catalogue_rdf
data set: Collection events
source: EGAS00001003805
resource: EGAS00001003805
title: EGAS00001003805 CeD_Poland
name: EGAS00001003805 CeD_Poland
pid: https://ega-archive.org/datasets/EGAD00010001763
description: Association results from Polish cohort
keyword: Polish cohort
keywords: Polish cohort
keyword: GWAS
keywords: GWAS
keyword: celiac disease
keywords: celiac disease
number of participants: 1062
data categories: http://umcgresearchdatacatalogue.nl/CatalogueOntologies/api/rdf/DataCategories/name=Genomics
standardized tools other: Immunochip
publisher: EGAS00001003805 UMCG
creator: EGAS00001003805 UMCG
theme: http://umcgresearchdatacatalogue.nl/CatalogueOntologies/api/rdf/Themes/name=Health
theme: HEAL
access rights: http://umcgresearchdatacatalogue.nl/CatalogueOntologies/api/rdf/AccessRights/name=Non%20public
access rights: NON PUBLIC
applicable legislation: http://umcgresearchdatacatalogue.nl/CatalogueOntologies/api/rdf/Legislations/name=Data%20Governance%20Act
applicable legislation: oj
mg_insertedOn: 2026-05-13T12:02:11
mg_updatedOn: 2026-05-13T12:02:11

EGAS00001003805 EGAS00001003805 CeD_Netherlands
type: Collection events
type: Observation
endpoint URL: catalogue_rdf
data set: Collection events
source: EGAS00001003805
resource: EGAS00001003805
title: EGAS00001003805 CeD_Netherlands
name: EGAS00001003805 CeD_Netherlands
pid: https://ega-archive.org/datasets/EGAD00010001764
description: Association results from the Dutch cohort
keyword: GWAS
keywords: GWAS
keyword: celiac disease
keywords: celiac disease
keyword: Dutch cohort
keywords: Dutch cohort
number of participants: 3378
data categories: http://umcgresearchdatacatalogue.nl/CatalogueOntologies/api/rdf/DataCategories/name=Genomics
standardized tools other: Immunochip
publisher: EGAS00001003805 UMCG
creator: EGAS00001003805 UMCG
theme: http://umcgresearchdatacatalogue.nl/CatalogueOntologies/api/rdf/Themes/name=Health
theme: HEAL
access rights: http://umcgresearchdatacatalogue.nl/CatalogueOntologies/api/rdf/AccessRights/name=Non%20public
access rights: NON PUBLIC
applicable legislation: http://umcgresearchdatacatalogue.nl/CatalogueOntologies/api/rdf/Legislations/name=Data%20Governance%20Act
applicable legislation: oj
mg_insertedOn: 2026-05-13T12:02:11
mg_updatedOn: 2026-05-13T12:02:11

EGAS00001003805 EGAS00001003805 CeD_Spain
type: Collection events
type: Observation
endpoint URL: catalogue_rdf
data set: Collection events
source: EGAS00001003805
resource: EGAS00001003805
title: EGAS00001003805 CeD_Spain
name: EGAS00001003805 CeD_Spain
pid: https://ega-archive.org/datasets/EGAD00010001765
description: Association results from Spanish cohort
keyword: Spanish cohort
keywords: Spanish cohort
keyword: GWAS
keywords: GWAS
keyword: celiac disease
keywords: celiac disease
number of participants: 2325
data categories: http://umcgresearchdatacatalogue.nl/CatalogueOntologies/api/rdf/DataCategories/name=Genomics
standardized tools other: Immunochip
publisher: EGAS00001003805 UMCG
creator: EGAS00001003805 UMCG
theme: http://umcgresearchdatacatalogue.nl/CatalogueOntologies/api/rdf/Themes/name=Health
theme: HEAL
access rights: http://umcgresearchdatacatalogue.nl/CatalogueOntologies/api/rdf/AccessRights/name=Non%20public
access rights: NON PUBLIC
applicable legislation: http://umcgresearchdatacatalogue.nl/CatalogueOntologies/api/rdf/Legislations/name=Data%20Governance%20Act
applicable legislation: oj
mg_insertedOn: 2026-05-13T12:02:11
mg_updatedOn: 2026-05-13T12:02:11

EGAS00001003805 EGAS00001003805 CeD_Argentina_2
type: Collection events
type: Observation
endpoint URL: catalogue_rdf
data set: Collection events
source: EGAS00001003805
resource: EGAS00001003805
title: EGAS00001003805 CeD_Argentina_2
name: EGAS00001003805 CeD_Argentina_2
pid: https://ega-archive.org/datasets/EGAD00010001766
description: Association results fromthe Agentinian cohort two
keyword: celiac disease
keywords: celiac disease
keyword: GWAS
keywords: GWAS
keyword: Argentinian cohort 2
keywords: Argentinian cohort 2
number of participants: 465
data categories: http://umcgresearchdatacatalogue.nl/CatalogueOntologies/api/rdf/DataCategories/name=Genomics
standardized tools other: Immunochip
publisher: EGAS00001003805 UMCG
creator: EGAS00001003805 UMCG
theme: http://umcgresearchdatacatalogue.nl/CatalogueOntologies/api/rdf/Themes/name=Health
theme: HEAL
access rights: http://umcgresearchdatacatalogue.nl/CatalogueOntologies/api/rdf/AccessRights/name=Non%20public
access rights: NON PUBLIC
applicable legislation: http://umcgresearchdatacatalogue.nl/CatalogueOntologies/api/rdf/Legislations/name=Data%20Governance%20Act
applicable legislation: oj
mg_insertedOn: 2026-05-13T12:02:11
mg_updatedOn: 2026-05-13T12:02:11

EGAS00001003805 EGAS00001003805 CeD_UnitedKingdom
type: Collection events
type: Observation
endpoint URL: catalogue_rdf
data set: Collection events
source: EGAS00001003805
resource: EGAS00001003805
title: EGAS00001003805 CeD_UnitedKingdom
name: EGAS00001003805 CeD_UnitedKingdom
pid: https://ega-archive.org/datasets/EGAD00010001767
description: Association results from British cohort
keyword: British cohort
keywords: British cohort
keyword: GWAS
keywords: GWAS
keyword: celiac disease
keywords: celiac disease
number of participants: 16002
data categories: http://umcgresearchdatacatalogue.nl/CatalogueOntologies/api/rdf/DataCategories/name=Genomics
standardized tools other: Immunochip
publisher: EGAS00001003805 UMCG
creator: EGAS00001003805 UMCG
theme: http://umcgresearchdatacatalogue.nl/CatalogueOntologies/api/rdf/Themes/name=Health
theme: HEAL
access rights: http://umcgresearchdatacatalogue.nl/CatalogueOntologies/api/rdf/AccessRights/name=Non%20public
access rights: NON PUBLIC
applicable legislation: http://umcgresearchdatacatalogue.nl/CatalogueOntologies/api/rdf/Legislations/name=Data%20Governance%20Act
applicable legislation: oj
mg_insertedOn: 2026-05-13T12:02:11
mg_updatedOn: 2026-05-13T12:02:11

EGAS00001003805 EGAS00001003805 CeD_Argentina_1
type: Collection events
type: Observation
endpoint URL: catalogue_rdf
data set: Collection events
source: EGAS00001003805
resource: EGAS00001003805
title: EGAS00001003805 CeD_Argentina_1
name: EGAS00001003805 CeD_Argentina_1
pid: https://ega-archive.org/datasets/EGAD00010001768
description: Association results from the Agentinian cohort one
keyword: celiac disease
keywords: celiac disease
keyword: GWAS
keywords: GWAS
keyword: Argentianian cohort 1
keywords: Argentianian cohort 1
number of participants: 741
data categories: http://umcgresearchdatacatalogue.nl/CatalogueOntologies/api/rdf/DataCategories/name=Genomics
standardized tools other: Immunochip
publisher: EGAS00001003805 UMCG
creator: EGAS00001003805 UMCG
theme: http://umcgresearchdatacatalogue.nl/CatalogueOntologies/api/rdf/Themes/name=Health
theme: HEAL
access rights: http://umcgresearchdatacatalogue.nl/CatalogueOntologies/api/rdf/AccessRights/name=Non%20public
access rights: NON PUBLIC
applicable legislation: http://umcgresearchdatacatalogue.nl/CatalogueOntologies/api/rdf/Legislations/name=Data%20Governance%20Act
applicable legislation: oj
mg_insertedOn: 2026-05-13T12:02:11
mg_updatedOn: 2026-05-13T12:02:11

AcuteLines AcuteLines Follow-up (2 years)
type: Collection events
type: Observation
endpoint URL: catalogue_rdf
data set: Collection events
source: AcuteLines
resource: AcuteLines
title: AcuteLines Follow-up (2 years)
name: AcuteLines Follow-up (2 years)
pid: https://umcgresearchdatacatalogue.nl/all/collections/AcuteLines/collection-events/AcuteLines%20Follow-up%20(2%20years)
description: Research in acute care faces many challenges, including enrollment challenges, legal limitations in data sharing, limited funding, and lack of singular ownership of the domain of acute care. To overcome some of these challenges, the Center of Acute Care of the University Medical Center Groningen in the Netherlands, has established a de novo data-, image- and biobank named "Acutelines". Acutelines is initiated to improve recognition and treatment of acute diseases and obtain insight in the consequences of acute diseases, including factors predicting its outcome. Thereby, Acutelines contributes to development of personalized treatment and improves prediction of patient outcomes after an acute admission.
source: AcuteLines AcuteLines Category A
subpopulations: AcuteLines AcuteLines Category A
source: AcuteLines AcuteLines Category B
subpopulations: AcuteLines AcuteLines Category B
keyword: Emergencies
keywords: Emergencies
keyword: ECG
keywords: ECG
keyword: Acute Illness
keywords: Acute Illness
keyword: Metabolism
keywords: Metabolism
keyword: Precision Medicine
keywords: Precision Medicine
keyword: Skin Infection
keywords: Skin Infection
keyword: Urinary Tract Infections
keywords: Urinary Tract Infections
keyword: Hemorrhage
keywords: Hemorrhage
keyword: Microbiology
keywords: Microbiology
keyword: Acute Care
keywords: Acute Care
keyword: Emergency Medicine
keywords: Emergency Medicine
keyword: Shock
keywords: Shock
keyword: Internal Medicine
keywords: Internal Medicine
keyword: Rehospitalization
keywords: Rehospitalization
keyword: Illness Prediction
keywords: Illness Prediction
keyword: Acutelines
keywords: Acutelines
keyword: Urine
keywords: Urine
keyword: Acute Medicine
keywords: Acute Medicine
keyword: RNA
keywords: RNA
keyword: Virology
keywords: Virology
keyword: Intoxication By Drug
keywords: Intoxication By Drug
keyword: PAXGene
keywords: PAXGene
keyword: Transcriptomics
keywords: Transcriptomics
keyword: Septic Shock
keywords: Septic Shock
keyword: Proteome
keywords: Proteome
keyword: Quality Of Life
keywords: Quality Of Life
keyword: Easures
keywords: Easures
keyword: Personalized Medicine
keywords: Personalized Medicine
keyword: Genomics
keywords: Genomics
keyword: Patient Reported Outcome Measures
keywords: Patient Reported Outcome Measures
keyword: Microbiome
keywords: Microbiome
keyword: Polypharmacy
keywords: Polypharmacy
keyword: Patient Reported Evaluation Measures

AcuteLines AcuteLines Follow-up (3 monthts)
type: Collection events
type: Observation
endpoint URL: catalogue_rdf
data set: Collection events
source: AcuteLines
resource: AcuteLines
title: AcuteLines Follow-up (3 monthts)
name: AcuteLines Follow-up (3 monthts)
pid: https://umcgresearchdatacatalogue.nl/all/collections/AcuteLines/collection-events/AcuteLines%20Follow-up%20(3%20monthts)
description: Research in acute care faces many challenges, including enrollment challenges, legal limitations in data sharing, limited funding, and lack of singular ownership of the domain of acute care. To overcome some of these challenges, the Center of Acute Care of the University Medical Center Groningen in the Netherlands, has established a de novo data-, image- and biobank named "Acutelines". Acutelines is initiated to improve recognition and treatment of acute diseases and obtain insight in the consequences of acute diseases, including factors predicting its outcome. Thereby, Acutelines contributes to development of personalized treatment and improves prediction of patient outcomes after an acute admission.
source: AcuteLines AcuteLines Category A
subpopulations: AcuteLines AcuteLines Category A
source: AcuteLines AcuteLines Category B
subpopulations: AcuteLines AcuteLines Category B
keyword: Emergencies
keywords: Emergencies
keyword: ECG
keywords: ECG
keyword: Acute Illness
keywords: Acute Illness
keyword: Metabolism
keywords: Metabolism
keyword: Precision Medicine
keywords: Precision Medicine
keyword: Skin Infection
keywords: Skin Infection
keyword: Urinary Tract Infections
keywords: Urinary Tract Infections
keyword: Hemorrhage
keywords: Hemorrhage
keyword: Microbiology
keywords: Microbiology
keyword: Acute Care
keywords: Acute Care
keyword: Emergency Medicine
keywords: Emergency Medicine
keyword: Shock
keywords: Shock
keyword: Internal Medicine
keywords: Internal Medicine
keyword: Rehospitalization
keywords: Rehospitalization
keyword: Illness Prediction
keywords: Illness Prediction
keyword: Acutelines
keywords: Acutelines
keyword: Urine
keywords: Urine
keyword: Acute Medicine
keywords: Acute Medicine
keyword: RNA
keywords: RNA
keyword: Virology
keywords: Virology
keyword: Intoxication By Drug
keywords: Intoxication By Drug
keyword: PAXGene
keywords: PAXGene
keyword: Transcriptomics
keywords: Transcriptomics
keyword: Septic Shock
keywords: Septic Shock
keyword: Proteome
keywords: Proteome
keyword: Quality Of Life
keywords: Quality Of Life
keyword: Easures
keywords: Easures
keyword: Personalized Medicine
keywords: Personalized Medicine
keyword: Genomics
keywords: Genomics
keyword: Patient Reported Outcome Measures
keywords: Patient Reported Outcome Measures
keyword: Microbiome
keywords: Microbiome
keyword: Polypharmacy
keywords: Polypharmacy
keyword: Patient Reported Evaluation Measures

EGAS00001003805 EGAS00001003805 CeD_Ireland
type: Collection events
type: Observation
endpoint URL: catalogue_rdf
data set: Collection events
source: EGAS00001003805
resource: EGAS00001003805
title: EGAS00001003805 CeD_Ireland
name: EGAS00001003805 CeD_Ireland
pid: https://ega-archive.org/datasets/EGAD00010001769
description: Association results from the Irish cohort
keyword: Irish cohort
keywords: Irish cohort
keyword: GWAS
keywords: GWAS
keyword: celiac disease
keywords: celiac disease
number of participants: 848
data categories: http://umcgresearchdatacatalogue.nl/CatalogueOntologies/api/rdf/DataCategories/name=Genomics
standardized tools other: Immunochip
publisher: EGAS00001003805 UMCG
creator: EGAS00001003805 UMCG
theme: http://umcgresearchdatacatalogue.nl/CatalogueOntologies/api/rdf/Themes/name=Health
theme: HEAL
access rights: http://umcgresearchdatacatalogue.nl/CatalogueOntologies/api/rdf/AccessRights/name=Non%20public
access rights: NON PUBLIC
applicable legislation: http://umcgresearchdatacatalogue.nl/CatalogueOntologies/api/rdf/Legislations/name=Data%20Governance%20Act
applicable legislation: oj
mg_insertedOn: 2026-05-13T12:02:11
mg_updatedOn: 2026-05-13T12:02:11

EGAS00001003805 EGAS00001003805 CeD_meta_analysis
type: Collection events
type: Observation
endpoint URL: catalogue_rdf
data set: Collection events
source: EGAS00001003805
resource: EGAS00001003805
title: EGAS00001003805 CeD_meta_analysis
name: EGAS00001003805 CeD_meta_analysis
pid: https://ega-archive.org/datasets/EGAD00010001770
description: Results of the celiac diease meta-analysis
keyword: GWAS
keywords: GWAS
keyword: celiac disease
keywords: celiac disease
keyword: meta-analysis
keywords: meta-analysis
number of participants: 27786
data categories: http://umcgresearchdatacatalogue.nl/CatalogueOntologies/api/rdf/DataCategories/name=Genomics
standardized tools other: Immunochip
publisher: EGAS00001003805 UMCG
creator: EGAS00001003805 UMCG
theme: http://umcgresearchdatacatalogue.nl/CatalogueOntologies/api/rdf/Themes/name=Health
theme: HEAL
access rights: http://umcgresearchdatacatalogue.nl/CatalogueOntologies/api/rdf/AccessRights/name=Non%20public
access rights: NON PUBLIC
applicable legislation: http://umcgresearchdatacatalogue.nl/CatalogueOntologies/api/rdf/Legislations/name=Data%20Governance%20Act
applicable legislation: oj
mg_insertedOn: 2026-05-13T12:02:11
mg_updatedOn: 2026-05-13T12:02:11

EGAS00001003805 EGAS00001003805 CeD_Italy
type: Collection events
type: Observation
endpoint URL: catalogue_rdf
data set: Collection events
source: EGAS00001003805
resource: EGAS00001003805
title: EGAS00001003805 CeD_Italy
name: EGAS00001003805 CeD_Italy
pid: https://ega-archive.org/datasets/EGAD00010001771
description: Association results from the Italian cohort
keyword: Italian cohort
keywords: Italian cohort
keyword: GWAS
keywords: GWAS
keyword: celiac disease
keywords: celiac disease
number of participants: 2965
data categories: http://umcgresearchdatacatalogue.nl/CatalogueOntologies/api/rdf/DataCategories/name=Genomics
standardized tools other: Immunochip
publisher: EGAS00001003805 UMCG
creator: EGAS00001003805 UMCG
theme: http://umcgresearchdatacatalogue.nl/CatalogueOntologies/api/rdf/Themes/name=Health
theme: HEAL
access rights: http://umcgresearchdatacatalogue.nl/CatalogueOntologies/api/rdf/AccessRights/name=Non%20public
access rights: NON PUBLIC
applicable legislation: http://umcgresearchdatacatalogue.nl/CatalogueOntologies/api/rdf/Legislations/name=Data%20Governance%20Act
applicable legislation: oj
mg_insertedOn: 2026-05-13T12:02:11
mg_updatedOn: 2026-05-13T12:02:11

EGAS00001006999 EGAS00001006999 LLD PhIPSeq
type: Collection events
type: Observation
endpoint URL: catalogue_rdf
data set: Collection events
source: EGAS00001006999
resource: EGAS00001006999
title: EGAS00001006999 LLD PhIPSeq
name: EGAS00001006999 LLD PhIPSeq
pid: https://ega-archive.org/datasets/EGAD00001010104
description: LLD PhIP-Seq reads. Oligopeptides were designed at Eran's Segal group at Weizmann Institute of Science. Dataset include 1,783 plasma samples. In 340 participants, a second time point was taken after a 4-year follow-up.
keyword: Lifelines Deep
keywords: Lifelines Deep
keyword: PhIP-Seq
keywords: PhIP-Seq
number of participants: 1784
data categories: http://umcgresearchdatacatalogue.nl/CatalogueOntologies/api/rdf/DataCategories/name=Genomics
standardized tools other: NextSeq 500
contact point: EGAS00001006999 Lifelines Data Management
publisher: EGAS00001006999 UMCG
creator: EGAS00001006999 UMCG
theme: http://umcgresearchdatacatalogue.nl/CatalogueOntologies/api/rdf/Themes/name=Health
theme: HEAL
access rights: http://umcgresearchdatacatalogue.nl/CatalogueOntologies/api/rdf/AccessRights/name=Non%20public
access rights: NON PUBLIC
applicable legislation: http://umcgresearchdatacatalogue.nl/CatalogueOntologies/api/rdf/Legislations/name=Data%20Governance%20Act
applicable legislation: oj
mg_draft: false
mg_insertedOn: 2026-05-13T12:02:11
mg_updatedOn: 2026-05-13T12:02:11

EGAS00001000644 EGAS00001000644 GoNL raw sequence data in fastq format
type: Collection events
type: Observation
endpoint URL: catalogue_rdf
data set: Collection events
source: EGAS00001000644
resource: EGAS00001000644
title: EGAS00001000644 GoNL raw sequence data in fastq format
name: EGAS00001000644 GoNL raw sequence data in fastq format
pid: https://ega-archive.org/datasets/EGAD00001000821
description: Raw sequencing data for all samples in fastq format.
keyword: raw data
keywords: raw data
keyword: EGA
keywords: EGA
keyword: fastql
keywords: fastql
keyword: GoNL
keywords: GoNL
number of participants: 767
data categories: http://umcgresearchdatacatalogue.nl/CatalogueOntologies/api/rdf/DataCategories/name=Genomics
standardized tools other: Illumina HiSeq 2000
contact point: EGAS00001000644 Gert-Jan van de Geijn
publisher: EGAS00001000644 UMCG
creator: EGAS00001000644 UMCG
theme: http://umcgresearchdatacatalogue.nl/CatalogueOntologies/api/rdf/Themes/name=Health
theme: HEAL
access rights: http://umcgresearchdatacatalogue.nl/CatalogueOntologies/api/rdf/AccessRights/name=Non%20public
access rights: NON PUBLIC
applicable legislation: http://umcgresearchdatacatalogue.nl/CatalogueOntologies/api/rdf/Legislations/name=Data%20Governance%20Act
applicable legislation: oj
mg_insertedOn: 2026-05-13T12:02:11
mg_updatedOn: 2026-05-13T12:02:11

LIFELINES_NEXT LIFELINES_NEXT P32
type: Collection events
type: Observation
endpoint URL: catalogue_rdf
data set: Collection events
source: LIFELINES_NEXT
resource: LIFELINES_NEXT
title: LIFELINES_NEXT P32
name: LIFELINES_NEXT P32
pid: https://umcgresearchdatacatalogue.nl/all/collections/LIFELINES_NEXT/collection-events/LIFELINES_NEXT%20P32
description: Data collection at gestational age of 32 weeks
source: LIFELINES_NEXT LIFELINES_NEXT Mothers
subpopulations: LIFELINES_NEXT LIFELINES_NEXT Mothers
keyword: Breast milk
keywords: Breast milk
keyword: Development
keywords: Development
keyword: Urine
keywords: Urine
keyword: Blood
keywords: Blood
keyword: Cord blood
keywords: Cord blood
keyword: Healthy ageing
keywords: Healthy ageing
keyword: Birth cohort
keywords: Birth cohort
keyword: Transgenerational effects
keywords: Transgenerational effects
keyword: Meconium
keywords: Meconium
keyword: Microbiome
keywords: Microbiome
keyword: Biobank
keywords: Biobank
keyword: Feces
keywords: Feces
start date: 2016-01-01
age groups: http://umcgresearchdatacatalogue.nl/CatalogueOntologies/api/rdf/AgeGroups/name=Young%20adult%20%2818-24%20years%29
age groups: http://umcgresearchdatacatalogue.nl/CatalogueOntologies/api/rdf/AgeGroups/name=Middle-aged%20%2845-64%20years%29
age groups: http://umcgresearchdatacatalogue.nl/CatalogueOntologies/api/rdf/AgeGroups/name=Adult%20%2825-44%20years%29
number of participants: 1450
areas of information: http://umcgresearchdatacatalogue.nl/CatalogueOntologies/api/rdf/AreasOfInformationCohorts/name=Medication%20and%20supplement%20intake
areas of information: http://umcgresearchdatacatalogue.nl/CatalogueOntologies/api/rdf/AreasOfInformationCohorts/name=Housing%20characteristics
areas of information: http://umcgresearchdatacatalogue.nl/CatalogueOntologies/api/rdf/AreasOfInformationCohorts/name=Anthropometry
areas of information: http://umcgresearchdatacatalogue.nl/CatalogueOntologies/api/rdf/AreasOfInformationCohorts/name=Ethnicity%2C%20race%20and%20religion
areas of information: http://umcgresearchdatacatalogue.nl/CatalogueOntologies/api/rdf/AreasOfInformationCohorts/name=Questionnaire%20and%20interview-related%20information
areas of information: http://umcgresearchdatacatalogue.nl/CatalogueOntologies/api/rdf/AreasOfInformationCohorts/name=Nutrition
data categories: http://umcgresearchdatacatalogue.nl/CatalogueOntologies/api/rdf/DataCategories/name=Survey%20data
standardized tools other: Preventie en Incidentie van Astma en Mijt Allergie (PIAMA)
contact point: LIFELINES_NEXT Lifelines NEXT Contact
publisher: LIFELINES_NEXT UMCG
creator: LIFELINES_NEXT UMCG
theme: http://umcgresearchdatacatalogue.nl/CatalogueOntologies/api/rdf/Themes/name=Health
theme: HEAL
access rights: http://umcgresearchdatacatalogue.nl/CatalogueOntologies/api/rdf/AccessRights/name=Non%20public
access rights: NON PUBLIC
applicable legislation: http://umcgresearchdatacatalogue.nl/CatalogueOntologies/api/rdf/Legislations/name=Data%20Governance%20Act
applicable legislation: oj
mg_draft: false
mg_insertedOn: 2026-05-13T12:02:11
mg_updatedOn: 2026-05-13T12:02:11

LIFELINES_NEXT LIFELINES_NEXT Birth
type: Collection events
type: Observation
endpoint URL: catalogue_rdf
data set: Collection events
source: LIFELINES_NEXT
resource: LIFELINES_NEXT
title: LIFELINES_NEXT Birth
name: LIFELINES_NEXT Birth
pid: https://umcgresearchdatacatalogue.nl/all/collections/LIFELINES_NEXT/collection-events/LIFELINES_NEXT%20Birth
description: Data collection at birth
source: LIFELINES_NEXT LIFELINES_NEXT Mothers
subpopulations: LIFELINES_NEXT LIFELINES_NEXT Mothers
source: LIFELINES_NEXT LIFELINES_NEXT Children
subpopulations: LIFELINES_NEXT LIFELINES_NEXT Children
keyword: Breast milk
keywords: Breast milk
keyword: Development
keywords: Development
keyword: Urine
keywords: Urine
keyword: Blood
keywords: Blood
keyword: Cord blood
keywords: Cord blood
keyword: Healthy ageing
keywords: Healthy ageing
keyword: Birth cohort
keywords: Birth cohort
keyword: Transgenerational effects
keywords: Transgenerational effects
keyword: Meconium
keywords: Meconium
keyword: Microbiome
keywords: Microbiome
keyword: Biobank
keywords: Biobank
keyword: Feces
keywords: Feces
start date: 2017-01-01
age groups: http://umcgresearchdatacatalogue.nl/CatalogueOntologies/api/rdf/AgeGroups/name=Young%20adult%20%2818-24%20years%29
age groups: http://umcgresearchdatacatalogue.nl/CatalogueOntologies/api/rdf/AgeGroups/name=Middle-aged%20%2845-64%20years%29
age groups: http://umcgresearchdatacatalogue.nl/CatalogueOntologies/api/rdf/AgeGroups/name=Adult%20%2825-44%20years%29
age groups: http://umcgresearchdatacatalogue.nl/CatalogueOntologies/api/rdf/AgeGroups/name=Newborn%20%280-1%20months%29
number of participants: 1450
areas of information: http://umcgresearchdatacatalogue.nl/CatalogueOntologies/api/rdf/AreasOfInformationCohorts/name=Microbiology
areas of information: http://umcgresearchdatacatalogue.nl/CatalogueOntologies/api/rdf/AreasOfInformationCohorts/name=Virology
areas of information: http://umcgresearchdatacatalogue.nl/CatalogueOntologies/api/rdf/AreasOfInformationCohorts/name=Hospitalizations
areas of information: http://umcgresearchdatacatalogue.nl/CatalogueOntologies/api/rdf/AreasOfInformationCohorts/name=Sex%2Fgender
areas of information: http://umcgresearchdatacatalogue.nl/CatalogueOntologies/api/rdf/AreasOfInformationCohorts/name=Anthropometry
areas of information: http://umcgresearchdatacatalogue.nl/CatalogueOntologies/api/rdf/AreasOfInformationCohorts/name=Age%2Fbirthdate
areas of information: http://umcgresearchdatacatalogue.nl/CatalogueOntologies/api/rdf/AreasOfInformationCohorts/name=Immunology
areas of information: http://umcgresearchdatacatalogue.nl/CatalogueOntologies/api/rdf/AreasOfInformationCohorts/name=Medication%20and%20supplement%20intake
areas of information: http://umcgresearchdatacatalogue.nl/CatalogueOntologies/api/rdf/AreasOfInformationCohorts/name=Twin
areas of information: http://umcgresearchdatacatalogue.nl/CatalogueOntologies/api/rdf/AreasOfInformationCohorts/name=Birthplace
areas of information: http://umcgresearchdatacatalogue.nl/CatalogueOntologies/api/rdf/AreasOfInformationCohorts/name=Genomics
areas of information: http://umcgresearchdatacatalogue.nl/CatalogueOntologies/api/rdf/AreasOfInformationCohorts/name=Pregnancy%2C%20delivery%20and%20birth
areas of information: http://umcgresearchdatacatalogue.nl/CatalogueOntologies/api/rdf/AreasOfInformationCohorts/name=Breastfeeding
data categories: http://umcgresearchdatacatalogue.nl/CatalogueOntologies/api/rdf/DataCategories/name=Medical%20records
data categories: http://umcgresearchdatacatalogue.nl/CatalogueOntologies/api/rdf/DataCategories/name=Biological%20samples
sample categories: http://umcgresearchdatacatalogue.nl/CatalogueOntologies/api/rdf/SampleCategories/name=DNA
sample categories: http://umcgresearchdatacatalogue.nl/CatalogueOntologies/api/rdf/SampleCategories/name=Plasma
sample categories: http://umcgresearchdatacatalogue.nl/CatalogueOntologies/api/rdf/SampleCategories/name=Blood%20%28whole%29
sample categories: http://umcgresearchdatacatalogue.nl/CatalogueOntologies/api/rdf/SampleCategories/name=Fetal%20blood%20%28Cord%20blood%29
sample categories: http://umcgresearchdatacatalogue.nl/CatalogueOntologies/api/rdf/SampleCategories/name=Blood
sample categories: http://umcgresearchdatacatalogue.nl/CatalogueOntologies/api/rdf/SampleCategories/name=Serum
sample categories: http://umcgresearchdatacatalogue.nl/CatalogueOntologies/api/rdf/SampleCategories/name=Placenta%20-%20Tissue%20%28Frozen%29
sample categories: http://umcgresearchdatacatalogue.nl/CatalogueOntologies/api/rdf/SampleCategories/name=RNA
sample categories: http://umcgresearchdatacatalogue.nl/CatalogueOntologies/api/rdf/SampleCategories/name=Vagina%20-%20Tissue%20%28Frozen%29
sample categories: http://umcgresearchdatacatalogue.nl/CatalogueOntologies/api/rdf/SampleCategories/name=Blood%20Buffy%20Coat
sample categories: http://umcgresearchdatacatalogue.nl/CatalogueOntologies/api/rdf/SampleCategories/name=Milk%2C%20Human
sample categories: http://umcgresearchdatacatalogue.nl/CatalogueOntologies/api/rdf/SampleCategories/name=Feces
core variables: Vaginal swab
core variables: Birth cards
core variables: Meconium
contact point: LIFELINES_NEXT Lifelines NEXT Contact
publisher: LIFELINES_NEXT UMCG
creator: LIFELINES_NEXT UMCG
theme: http://umcgresearchdatacatalogue.nl/CatalogueOntologies/api/rdf/Themes/name=Health
theme: HEAL

EGAS00001005027 EGAS00001005027 The Dutch Microbiome Project Batch 1
type: Collection events
type: Observation
endpoint URL: catalogue_rdf
data set: Collection events
source: EGAS00001005027
resource: EGAS00001005027
title: EGAS00001005027 The Dutch Microbiome Project Batch 1
name: EGAS00001005027 The Dutch Microbiome Project Batch 1
pid: https://ega-archive.org/datasets/EGAD00001007027
description: The Dutch Microbiome Project (DMP) data includes shotgun metagenomic sequencing of faecal samples 8,208 Dutch individuals. Paired-end sequencing was performed using Illumina HiSeq 2000 platform. Data is archived in two batches to facilitate easier data access and upload to EGA. Batch 1 of DMP includes 4396 samples.
keyword: shotgun metagenomic sequencing
keywords: shotgun metagenomic sequencing
keyword: microbiome
keywords: microbiome
number of participants: 4396
data categories: http://umcgresearchdatacatalogue.nl/CatalogueOntologies/api/rdf/DataCategories/name=Genomics
standardized tools other: Illumina HiSeq 2000
contact point: EGAS00001005027 Lifelines Data Management
publisher: EGAS00001005027 UMCG
creator: EGAS00001005027 UMCG
theme: http://umcgresearchdatacatalogue.nl/CatalogueOntologies/api/rdf/Themes/name=Health
theme: HEAL
access rights: http://umcgresearchdatacatalogue.nl/CatalogueOntologies/api/rdf/AccessRights/name=Non%20public
access rights: NON PUBLIC
applicable legislation: http://umcgresearchdatacatalogue.nl/CatalogueOntologies/api/rdf/Legislations/name=Data%20Governance%20Act
applicable legislation: oj
mg_draft: false
mg_insertedOn: 2026-05-13T12:02:11
mg_updatedOn: 2026-05-13T12:02:11

AcuteLines AcuteLines Follow-up (12 months)
type: Collection events
type: Observation
endpoint URL: catalogue_rdf
data set: Collection events
source: AcuteLines
resource: AcuteLines
title: AcuteLines Follow-up (12 months)
name: AcuteLines Follow-up (12 months)
pid: https://umcgresearchdatacatalogue.nl/all/collections/AcuteLines/collection-events/AcuteLines%20Follow-up%20(12%20months)
description: Research in acute care faces many challenges, including enrollment challenges, legal limitations in data sharing, limited funding, and lack of singular ownership of the domain of acute care. To overcome some of these challenges, the Center of Acute Care of the University Medical Center Groningen in the Netherlands, has established a de novo data-, image- and biobank named "Acutelines". Acutelines is initiated to improve recognition and treatment of acute diseases and obtain insight in the consequences of acute diseases, including factors predicting its outcome. Thereby, Acutelines contributes to development of personalized treatment and improves prediction of patient outcomes after an acute admission.
source: AcuteLines AcuteLines Category A
subpopulations: AcuteLines AcuteLines Category A
source: AcuteLines AcuteLines Category B
subpopulations: AcuteLines AcuteLines Category B
keyword: Emergencies
keywords: Emergencies
keyword: ECG
keywords: ECG
keyword: Acute Illness
keywords: Acute Illness
keyword: Metabolism
keywords: Metabolism
keyword: Precision Medicine
keywords: Precision Medicine
keyword: Skin Infection
keywords: Skin Infection
keyword: Urinary Tract Infections
keywords: Urinary Tract Infections
keyword: Hemorrhage
keywords: Hemorrhage
keyword: Microbiology
keywords: Microbiology
keyword: Acute Care
keywords: Acute Care
keyword: Emergency Medicine
keywords: Emergency Medicine
keyword: Shock
keywords: Shock
keyword: Internal Medicine
keywords: Internal Medicine
keyword: Rehospitalization
keywords: Rehospitalization
keyword: Illness Prediction
keywords: Illness Prediction
keyword: Acutelines
keywords: Acutelines
keyword: Urine
keywords: Urine
keyword: Acute Medicine
keywords: Acute Medicine
keyword: RNA
keywords: RNA
keyword: Virology
keywords: Virology
keyword: Intoxication By Drug
keywords: Intoxication By Drug
keyword: PAXGene
keywords: PAXGene
keyword: Transcriptomics
keywords: Transcriptomics
keyword: Septic Shock
keywords: Septic Shock
keyword: Proteome
keywords: Proteome
keyword: Quality Of Life
keywords: Quality Of Life
keyword: Easures
keywords: Easures
keyword: Personalized Medicine
keywords: Personalized Medicine
keyword: Genomics
keywords: Genomics
keyword: Patient Reported Outcome Measures
keywords: Patient Reported Outcome Measures
keyword: Microbiome
keywords: Microbiome
keyword: Polypharmacy
keywords: Polypharmacy
keyword: Patient Reported Evaluation Measures

LIFELINES_NEXT LIFELINES_NEXT M1
type: Collection events
type: Observation
endpoint URL: catalogue_rdf
data set: Collection events
source: LIFELINES_NEXT
resource: LIFELINES_NEXT
title: LIFELINES_NEXT M1
name: LIFELINES_NEXT M1
pid: https://umcgresearchdatacatalogue.nl/all/collections/LIFELINES_NEXT/collection-events/LIFELINES_NEXT%20M1
description: Data collection at infant's age of 1 month
source: LIFELINES_NEXT LIFELINES_NEXT Mothers
subpopulations: LIFELINES_NEXT LIFELINES_NEXT Mothers
source: LIFELINES_NEXT LIFELINES_NEXT Children
subpopulations: LIFELINES_NEXT LIFELINES_NEXT Children
keyword: Breast milk
keywords: Breast milk
keyword: Development
keywords: Development
keyword: Urine
keywords: Urine
keyword: Blood
keywords: Blood
keyword: Cord blood
keywords: Cord blood
keyword: Healthy ageing
keywords: Healthy ageing
keyword: Birth cohort
keywords: Birth cohort
keyword: Transgenerational effects
keywords: Transgenerational effects
keyword: Meconium
keywords: Meconium
keyword: Microbiome
keywords: Microbiome
keyword: Biobank
keywords: Biobank
keyword: Feces
keywords: Feces
start date: 2017-01-01
age groups: http://umcgresearchdatacatalogue.nl/CatalogueOntologies/api/rdf/AgeGroups/name=Young%20adult%20%2818-24%20years%29
age groups: http://umcgresearchdatacatalogue.nl/CatalogueOntologies/api/rdf/AgeGroups/name=Middle-aged%20%2845-64%20years%29
age groups: http://umcgresearchdatacatalogue.nl/CatalogueOntologies/api/rdf/AgeGroups/name=Adult%20%2825-44%20years%29
age groups: http://umcgresearchdatacatalogue.nl/CatalogueOntologies/api/rdf/AgeGroups/name=Newborn%20%280-1%20months%29
number of participants: 1450
areas of information: http://umcgresearchdatacatalogue.nl/CatalogueOntologies/api/rdf/AreasOfInformationCohorts/name=Questionnaire%20and%20interview-related%20information
areas of information: http://umcgresearchdatacatalogue.nl/CatalogueOntologies/api/rdf/AreasOfInformationCohorts/name=Pregnancy%2C%20delivery%20and%20birth
areas of information: http://umcgresearchdatacatalogue.nl/CatalogueOntologies/api/rdf/AreasOfInformationCohorts/name=Breastfeeding
areas of information: http://umcgresearchdatacatalogue.nl/CatalogueOntologies/api/rdf/AreasOfInformationCohorts/name=Nutrition
areas of information: http://umcgresearchdatacatalogue.nl/CatalogueOntologies/api/rdf/AreasOfInformationCohorts/name=Tobacco
areas of information: http://umcgresearchdatacatalogue.nl/CatalogueOntologies/api/rdf/AreasOfInformationCohorts/name=Drugs
areas of information: http://umcgresearchdatacatalogue.nl/CatalogueOntologies/api/rdf/AreasOfInformationCohorts/name=Alcohol
areas of information: http://umcgresearchdatacatalogue.nl/CatalogueOntologies/api/rdf/AreasOfInformationCohorts/name=Virology
areas of information: http://umcgresearchdatacatalogue.nl/CatalogueOntologies/api/rdf/AreasOfInformationCohorts/name=Medication%20and%20supplement%20intake
areas of information: http://umcgresearchdatacatalogue.nl/CatalogueOntologies/api/rdf/AreasOfInformationCohorts/name=Microbiology
areas of information: http://umcgresearchdatacatalogue.nl/CatalogueOntologies/api/rdf/AreasOfInformationCohorts/name=Genomics
areas of information: http://umcgresearchdatacatalogue.nl/CatalogueOntologies/api/rdf/AreasOfInformationCohorts/name=Contraception
areas of information: http://umcgresearchdatacatalogue.nl/CatalogueOntologies/api/rdf/AreasOfInformationCohorts/name=Life%20events
areas of information: http://umcgresearchdatacatalogue.nl/CatalogueOntologies/api/rdf/AreasOfInformationCohorts/name=Perception%20of%20health
data categories: http://umcgresearchdatacatalogue.nl/CatalogueOntologies/api/rdf/DataCategories/name=Genomics
data categories: http://umcgresearchdatacatalogue.nl/CatalogueOntologies/api/rdf/DataCategories/name=Biological%20samples
data categories: http://umcgresearchdatacatalogue.nl/CatalogueOntologies/api/rdf/DataCategories/name=Survey%20data
sample categories: http://umcgresearchdatacatalogue.nl/CatalogueOntologies/api/rdf/SampleCategories/name=Feces
sample categories: http://umcgresearchdatacatalogue.nl/CatalogueOntologies/api/rdf/SampleCategories/name=Blood%20Buffy%20Coat
sample categories: http://umcgresearchdatacatalogue.nl/CatalogueOntologies/api/rdf/SampleCategories/name=DNA
sample categories: http://umcgresearchdatacatalogue.nl/CatalogueOntologies/api/rdf/SampleCategories/name=Serum
sample categories: http://umcgresearchdatacatalogue.nl/CatalogueOntologies/api/rdf/SampleCategories/name=Plasma
sample categories: http://umcgresearchdatacatalogue.nl/CatalogueOntologies/api/rdf/SampleCategories/name=Blood%20%28whole%29
sample categories: http://umcgresearchdatacatalogue.nl/CatalogueOntologies/api/rdf/SampleCategories/name=RNA
sample categories: http://umcgresearchdatacatalogue.nl/CatalogueOntologies/api/rdf/SampleCategories/name=Milk%2C%20Human
standardized tools: http://umcgresearchdatacatalogue.nl/CatalogueOntologies/api/rdf/StandardizedTools/name=3-Day%20Baby%20Day%20Diary
standardized tools: http://umcgresearchdatacatalogue.nl/CatalogueOntologies/api/rdf/StandardizedTools/name=Food%20Frequency%20Questionnaire
standardized tools: http://umcgresearchdatacatalogue.nl/CatalogueOntologies/api/rdf/StandardizedTools/name=Long-term%20Difficulties%20Inventory
standardized tools: http://umcgresearchdatacatalogue.nl/CatalogueOntologies/api/rdf/StandardizedTools/name=List%20of%20Threatening%20Experiences
standardized tools: http://umcgresearchdatacatalogue.nl/CatalogueOntologies/api/rdf/StandardizedTools/name=Rome%20III%20IBS%20Diagnostic%20Questionnaire
standardized tools other: Reproductive Origins of Adult Health and Disease (ROAHD)
contact point: LIFELINES_NEXT Lifelines NEXT Contact
publisher: LIFELINES_NEXT UMCG
creator: LIFELINES_NEXT UMCG
theme: http://umcgresearchdatacatalogue.nl/CatalogueOntologies/api/rdf/Themes/name=Health

AcuteLines AcuteLines Follow-up (5 years)
type: Collection events
type: Observation
endpoint URL: catalogue_rdf
data set: Collection events
source: AcuteLines
resource: AcuteLines
title: AcuteLines Follow-up (5 years)
name: AcuteLines Follow-up (5 years)
pid: https://umcgresearchdatacatalogue.nl/all/collections/AcuteLines/collection-events/AcuteLines%20Follow-up%20(5%20years)
description: Research in acute care faces many challenges, including enrollment challenges, legal limitations in data sharing, limited funding, and lack of singular ownership of the domain of acute care. To overcome some of these challenges, the Center of Acute Care of the University Medical Center Groningen in the Netherlands, has established a de novo data-, image- and biobank named "Acutelines". Acutelines is initiated to improve recognition and treatment of acute diseases and obtain insight in the consequences of acute diseases, including factors predicting its outcome. Thereby, Acutelines contributes to development of personalized treatment and improves prediction of patient outcomes after an acute admission.
source: AcuteLines AcuteLines Category A
subpopulations: AcuteLines AcuteLines Category A
source: AcuteLines AcuteLines Category B
subpopulations: AcuteLines AcuteLines Category B
keyword: Emergencies
keywords: Emergencies
keyword: ECG
keywords: ECG
keyword: Acute Illness
keywords: Acute Illness
keyword: Metabolism
keywords: Metabolism
keyword: Precision Medicine
keywords: Precision Medicine
keyword: Skin Infection
keywords: Skin Infection
keyword: Urinary Tract Infections
keywords: Urinary Tract Infections
keyword: Hemorrhage
keywords: Hemorrhage
keyword: Microbiology
keywords: Microbiology
keyword: Acute Care
keywords: Acute Care
keyword: Emergency Medicine
keywords: Emergency Medicine
keyword: Shock
keywords: Shock
keyword: Internal Medicine
keywords: Internal Medicine
keyword: Rehospitalization
keywords: Rehospitalization
keyword: Illness Prediction
keywords: Illness Prediction
keyword: Acutelines
keywords: Acutelines
keyword: Urine
keywords: Urine
keyword: Acute Medicine
keywords: Acute Medicine
keyword: RNA
keywords: RNA
keyword: Virology
keywords: Virology
keyword: Intoxication By Drug
keywords: Intoxication By Drug
keyword: PAXGene
keywords: PAXGene
keyword: Transcriptomics
keywords: Transcriptomics
keyword: Septic Shock
keywords: Septic Shock
keyword: Proteome
keywords: Proteome
keyword: Quality Of Life
keywords: Quality Of Life
keyword: Easures
keywords: Easures
keyword: Personalized Medicine
keywords: Personalized Medicine
keyword: Genomics
keywords: Genomics
keyword: Patient Reported Outcome Measures
keywords: Patient Reported Outcome Measures
keyword: Microbiome
keywords: Microbiome
keyword: Polypharmacy
keywords: Polypharmacy
keyword: Patient Reported Evaluation Measures

AcuteLines AcuteLines ED (baseline)
type: Collection events
type: Observation
endpoint URL: catalogue_rdf
data set: Collection events
source: AcuteLines
resource: AcuteLines
title: AcuteLines ED (baseline)
name: AcuteLines ED (baseline)
pid: https://umcgresearchdatacatalogue.nl/all/collections/AcuteLines/collection-events/AcuteLines%20ED%20(baseline)
description: Research in acute care faces many challenges, including enrollment challenges, legal limitations in data sharing, limited funding, and lack of singular ownership of the domain of acute care. To overcome some of these challenges, the Center of Acute Care of the University Medical Center Groningen in the Netherlands, has established a de novo data-, image- and biobank named "Acutelines". Acutelines is initiated to improve recognition and treatment of acute diseases and obtain insight in the consequences of acute diseases, including factors predicting its outcome. Thereby, Acutelines contributes to development of personalized treatment and improves prediction of patient outcomes after an acute admission.
source: AcuteLines AcuteLines Category C
subpopulations: AcuteLines AcuteLines Category C
source: AcuteLines AcuteLines Category B
subpopulations: AcuteLines AcuteLines Category B
source: AcuteLines AcuteLines Category A
subpopulations: AcuteLines AcuteLines Category A
keyword: Emergencies
keywords: Emergencies
keyword: ECG
keywords: ECG
keyword: Acute Illness
keywords: Acute Illness
keyword: Metabolism
keywords: Metabolism
keyword: Precision Medicine
keywords: Precision Medicine
keyword: Skin Infection
keywords: Skin Infection
keyword: Urinary Tract Infections
keywords: Urinary Tract Infections
keyword: Hemorrhage
keywords: Hemorrhage
keyword: Microbiology
keywords: Microbiology
keyword: Acute Care
keywords: Acute Care
keyword: Emergency Medicine
keywords: Emergency Medicine
keyword: Shock
keywords: Shock
keyword: Internal Medicine
keywords: Internal Medicine
keyword: Rehospitalization
keywords: Rehospitalization
keyword: Illness Prediction
keywords: Illness Prediction
keyword: Acutelines
keywords: Acutelines
keyword: Urine
keywords: Urine
keyword: Acute Medicine
keywords: Acute Medicine
keyword: RNA
keywords: RNA
keyword: Virology
keywords: Virology
keyword: Intoxication By Drug
keywords: Intoxication By Drug
keyword: PAXGene
keywords: PAXGene
keyword: Transcriptomics
keywords: Transcriptomics
keyword: Septic Shock
keywords: Septic Shock
keyword: Proteome
keywords: Proteome
keyword: Quality Of Life
keywords: Quality Of Life
keyword: Easures
keywords: Easures
keyword: Personalized Medicine
keywords: Personalized Medicine
keyword: Genomics
keywords: Genomics
keyword: Patient Reported Outcome Measures
keywords: Patient Reported Outcome Measures
keyword: Microbiome
keywords: Microbiome
keyword: Polypharmacy

AcuteLines AcuteLines Follow-up (lifelong)
type: Collection events
type: Observation
endpoint URL: catalogue_rdf
data set: Collection events
source: AcuteLines
resource: AcuteLines
title: AcuteLines Follow-up (lifelong)
name: AcuteLines Follow-up (lifelong)
pid: https://umcgresearchdatacatalogue.nl/all/collections/AcuteLines/collection-events/AcuteLines%20Follow-up%20(lifelong)
description: Research in acute care faces many challenges, including enrollment challenges, legal limitations in data sharing, limited funding, and lack of singular ownership of the domain of acute care. To overcome some of these challenges, the Center of Acute Care of the University Medical Center Groningen in the Netherlands, has established a de novo data-, image- and biobank named "Acutelines". Acutelines is initiated to improve recognition and treatment of acute diseases and obtain insight in the consequences of acute diseases, including factors predicting its outcome. Thereby, Acutelines contributes to development of personalized treatment and improves prediction of patient outcomes after an acute admission.
source: AcuteLines AcuteLines Category A
subpopulations: AcuteLines AcuteLines Category A
source: AcuteLines AcuteLines Category B
subpopulations: AcuteLines AcuteLines Category B
keyword: Emergencies
keywords: Emergencies
keyword: ECG
keywords: ECG
keyword: Acute Illness
keywords: Acute Illness
keyword: Metabolism
keywords: Metabolism
keyword: Precision Medicine
keywords: Precision Medicine
keyword: Skin Infection
keywords: Skin Infection
keyword: Urinary Tract Infections
keywords: Urinary Tract Infections
keyword: Hemorrhage
keywords: Hemorrhage
keyword: Microbiology
keywords: Microbiology
keyword: Acute Care
keywords: Acute Care
keyword: Emergency Medicine
keywords: Emergency Medicine
keyword: Shock
keywords: Shock
keyword: Internal Medicine
keywords: Internal Medicine
keyword: Rehospitalization
keywords: Rehospitalization
keyword: Illness Prediction
keywords: Illness Prediction
keyword: Acutelines
keywords: Acutelines
keyword: Urine
keywords: Urine
keyword: Acute Medicine
keywords: Acute Medicine
keyword: RNA
keywords: RNA
keyword: Virology
keywords: Virology
keyword: Intoxication By Drug
keywords: Intoxication By Drug
keyword: PAXGene
keywords: PAXGene
keyword: Transcriptomics
keywords: Transcriptomics
keyword: Septic Shock
keywords: Septic Shock
keyword: Proteome
keywords: Proteome
keyword: Quality Of Life
keywords: Quality Of Life
keyword: Easures
keywords: Easures
keyword: Personalized Medicine
keywords: Personalized Medicine
keyword: Genomics
keywords: Genomics
keyword: Patient Reported Outcome Measures
keywords: Patient Reported Outcome Measures
keyword: Microbiome
keywords: Microbiome
keyword: Polypharmacy
keywords: Polypharmacy
keyword: Patient Reported Evaluation Measures

AHON AHON Continuous collection
type: Collection events
type: Observation
endpoint URL: catalogue_rdf
data set: Collection events
source: AHON
resource: AHON
title: AHON Continuous collection
name: AHON Continuous collection
pid: https://umcgresearchdatacatalogue.nl/all/collections/AHON/collection-events/AHON%20Continuous%20collection
description: continuous data collection
source: AHON AHON RNG
subpopulations: AHON AHON RNG
source: AHON AHON General population
subpopulations: AHON AHON General population
keyword: VCIR
keywords: VCIR
keyword: morbidity
keywords: morbidity
keyword: registry
keywords: registry
keyword: machine learning
keywords: machine learning
keyword: NHG
keywords: NHG
keyword: Natural Language Processing
keywords: Natural Language Processing
keyword: GP
keywords: GP
keyword: HIS
keywords: HIS
keyword: general practicioner
keywords: general practicioner
keyword: huisarts
keywords: huisarts
keyword: primary care
keywords: primary care
keyword: vrije teksten
keywords: vrije teksten
keyword: eerstelijnszorg
keywords: eerstelijnszorg
keyword: ATC
keywords: ATC
keyword: general practice
keywords: general practice
keyword: ICPC
keywords: ICPC
keyword: primary care data
keywords: primary care data
start date: 1998-01-01
age groups: http://umcgresearchdatacatalogue.nl/CatalogueOntologies/api/rdf/AgeGroups/name=Infants%20and%20toddlers%20%282-23%20months%29
age groups: http://umcgresearchdatacatalogue.nl/CatalogueOntologies/api/rdf/AgeGroups/name=Adult%20%2818%2B%20years%29
age groups: http://umcgresearchdatacatalogue.nl/CatalogueOntologies/api/rdf/AgeGroups/name=Adult%20%2825-44%20years%29
age groups: http://umcgresearchdatacatalogue.nl/CatalogueOntologies/api/rdf/AgeGroups/name=Aged%20%2865%2B%20years%29
age groups: http://umcgresearchdatacatalogue.nl/CatalogueOntologies/api/rdf/AgeGroups/name=Middle-aged%20%2845-64%20years%29
age groups: http://umcgresearchdatacatalogue.nl/CatalogueOntologies/api/rdf/AgeGroups/name=All%20ages
age groups: http://umcgresearchdatacatalogue.nl/CatalogueOntologies/api/rdf/AgeGroups/name=Newborn%20%280-1%20months%29
age groups: http://umcgresearchdatacatalogue.nl/CatalogueOntologies/api/rdf/AgeGroups/name=Young%20adult%20%2818-24%20years%29
age groups: http://umcgresearchdatacatalogue.nl/CatalogueOntologies/api/rdf/AgeGroups/name=Adolescent%20%2813-17%20years%29
age groups: http://umcgresearchdatacatalogue.nl/CatalogueOntologies/api/rdf/AgeGroups/name=Infant%20%280-23%20months%29
age groups: http://umcgresearchdatacatalogue.nl/CatalogueOntologies/api/rdf/AgeGroups/name=Child%20%282-12%20years%29
number of participants: 600000
areas of information: http://umcgresearchdatacatalogue.nl/CatalogueOntologies/api/rdf/AreasOfInformationCohorts/name=Cause%20of%20death
areas of information: http://umcgresearchdatacatalogue.nl/CatalogueOntologies/api/rdf/AreasOfInformationCohorts/name=Posology%20and%20protocol%20of%20administration
areas of information: http://umcgresearchdatacatalogue.nl/CatalogueOntologies/api/rdf/AreasOfInformationCohorts/name=Laboratory%20diagnosis%20interventions
areas of information: http://umcgresearchdatacatalogue.nl/CatalogueOntologies/api/rdf/AreasOfInformationCohorts/name=Medication%20and%20supplements
areas of information: http://umcgresearchdatacatalogue.nl/CatalogueOntologies/api/rdf/AreasOfInformationCohorts/name=Sex%2Fgender
areas of information: http://umcgresearchdatacatalogue.nl/CatalogueOntologies/api/rdf/AreasOfInformationCohorts/name=Medication%20and%20supplement%20intake
areas of information: http://umcgresearchdatacatalogue.nl/CatalogueOntologies/api/rdf/AreasOfInformationCohorts/name=Surgical%20interventions
areas of information: http://umcgresearchdatacatalogue.nl/CatalogueOntologies/api/rdf/AreasOfInformationCohorts/name=Death
areas of information: http://umcgresearchdatacatalogue.nl/CatalogueOntologies/api/rdf/AreasOfInformationCohorts/name=Age%2Fbirthdate
areas of information: http://umcgresearchdatacatalogue.nl/CatalogueOntologies/api/rdf/AreasOfInformationCohorts/name=Visits%20to%20health%20professionals
areas of information: http://umcgresearchdatacatalogue.nl/CatalogueOntologies/api/rdf/AreasOfInformationCohorts/name=Other%20end%20of%20life%20or%20death-related%20information
areas of information: http://umcgresearchdatacatalogue.nl/CatalogueOntologies/api/rdf/AreasOfInformationCohorts/name=Other%20and%20unspecified%20pharmacological%20interventions
areas of information: http://umcgresearchdatacatalogue.nl/CatalogueOntologies/api/rdf/AreasOfInformationCohorts/name=Hospitalizations
areas of information: http://umcgresearchdatacatalogue.nl/CatalogueOntologies/api/rdf/AreasOfInformationCohorts/name=Vital%20status
areas of information: http://umcgresearchdatacatalogue.nl/CatalogueOntologies/api/rdf/AreasOfInformationCohorts/name=Radiological%20interventions
areas of information: http://umcgresearchdatacatalogue.nl/CatalogueOntologies/api/rdf/AreasOfInformationCohorts/name=Residence
data categories: http://umcgresearchdatacatalogue.nl/CatalogueOntologies/api/rdf/DataCategories/name=National%20registries
data categories: http://umcgresearchdatacatalogue.nl/CatalogueOntologies/api/rdf/DataCategories/name=Medical%20records

LIFELINES_NEXT LIFELINES_NEXT Y3
type: Collection events
type: Observation
endpoint URL: catalogue_rdf
data set: Collection events
source: LIFELINES_NEXT
resource: LIFELINES_NEXT
title: LIFELINES_NEXT Y3
name: LIFELINES_NEXT Y3
pid: https://umcgresearchdatacatalogue.nl/all/collections/LIFELINES_NEXT/collection-events/LIFELINES_NEXT%20Y3
description: Data collection at infant's age of 3 years
source: LIFELINES_NEXT LIFELINES_NEXT Children
subpopulations: LIFELINES_NEXT LIFELINES_NEXT Children
keyword: Breast milk
keywords: Breast milk
keyword: Development
keywords: Development
keyword: Urine
keywords: Urine
keyword: Blood
keywords: Blood
keyword: Cord blood
keywords: Cord blood
keyword: Healthy ageing
keywords: Healthy ageing
keyword: Birth cohort
keywords: Birth cohort
keyword: Transgenerational effects
keywords: Transgenerational effects
keyword: Meconium
keywords: Meconium
keyword: Microbiome
keywords: Microbiome
keyword: Biobank
keywords: Biobank
keyword: Feces
keywords: Feces
start date: 2022-01-01
age groups: http://umcgresearchdatacatalogue.nl/CatalogueOntologies/api/rdf/AgeGroups/name=Child%20%282-12%20years%29
number of participants: 1380
areas of information: http://umcgresearchdatacatalogue.nl/CatalogueOntologies/api/rdf/AreasOfInformationCohorts/name=Life%20course%20development
areas of information: http://umcgresearchdatacatalogue.nl/CatalogueOntologies/api/rdf/AreasOfInformationCohorts/name=Microbiology
areas of information: http://umcgresearchdatacatalogue.nl/CatalogueOntologies/api/rdf/AreasOfInformationCohorts/name=Perception%20of%20health
areas of information: http://umcgresearchdatacatalogue.nl/CatalogueOntologies/api/rdf/AreasOfInformationCohorts/name=Psychological%20distress%20and%20emotions
areas of information: http://umcgresearchdatacatalogue.nl/CatalogueOntologies/api/rdf/AreasOfInformationCohorts/name=Questionnaire%20and%20interview-related%20information
areas of information: http://umcgresearchdatacatalogue.nl/CatalogueOntologies/api/rdf/AreasOfInformationCohorts/name=Life%20events
areas of information: http://umcgresearchdatacatalogue.nl/CatalogueOntologies/api/rdf/AreasOfInformationCohorts/name=Parenting%20and%20familial%20environment
areas of information: http://umcgresearchdatacatalogue.nl/CatalogueOntologies/api/rdf/AreasOfInformationCohorts/name=Nutrition
areas of information: http://umcgresearchdatacatalogue.nl/CatalogueOntologies/api/rdf/AreasOfInformationCohorts/name=Medication%20and%20supplement%20intake
data categories: http://umcgresearchdatacatalogue.nl/CatalogueOntologies/api/rdf/DataCategories/name=Genomics
data categories: http://umcgresearchdatacatalogue.nl/CatalogueOntologies/api/rdf/DataCategories/name=Biological%20samples
data categories: http://umcgresearchdatacatalogue.nl/CatalogueOntologies/api/rdf/DataCategories/name=Survey%20data
sample categories: http://umcgresearchdatacatalogue.nl/CatalogueOntologies/api/rdf/SampleCategories/name=Feces
standardized tools: http://umcgresearchdatacatalogue.nl/CatalogueOntologies/api/rdf/StandardizedTools/name=International%20Study%20of%20Asthma%20and%20Allergies%20in%20Childhood%20Questionnaires
standardized tools: http://umcgresearchdatacatalogue.nl/CatalogueOntologies/api/rdf/StandardizedTools/name=Brief%20Infant%20Toddler%20Social%20Emotional%20Assessment
standardized tools: http://umcgresearchdatacatalogue.nl/CatalogueOntologies/api/rdf/StandardizedTools/name=Food%20Frequency%20Questionnaire
standardized tools: http://umcgresearchdatacatalogue.nl/CatalogueOntologies/api/rdf/StandardizedTools/name=Long-term%20Difficulties%20Inventory
standardized tools: http://umcgresearchdatacatalogue.nl/CatalogueOntologies/api/rdf/StandardizedTools/name=List%20of%20Threatening%20Experiences
standardized tools other: ROME IV IBS Diagnostic Questionnaire
contact point: LIFELINES_NEXT Lifelines NEXT Contact
publisher: LIFELINES_NEXT UMCG
creator: LIFELINES_NEXT UMCG
theme: http://umcgresearchdatacatalogue.nl/CatalogueOntologies/api/rdf/Themes/name=Health
theme: HEAL
access rights: http://umcgresearchdatacatalogue.nl/CatalogueOntologies/api/rdf/AccessRights/name=Non%20public
access rights: NON PUBLIC
applicable legislation: http://umcgresearchdatacatalogue.nl/CatalogueOntologies/api/rdf/Legislations/name=Data%20Governance%20Act
applicable legislation: oj
mg_draft: false
mg_insertedOn: 2026-05-13T12:02:11
mg_updatedOn: 2026-05-13T12:02:11

LIFELINES_NEXT LIFELINES_NEXT M12
type: Collection events
type: Observation
endpoint URL: catalogue_rdf
data set: Collection events
source: LIFELINES_NEXT
resource: LIFELINES_NEXT
title: LIFELINES_NEXT M12
name: LIFELINES_NEXT M12
pid: https://umcgresearchdatacatalogue.nl/all/collections/LIFELINES_NEXT/collection-events/LIFELINES_NEXT%20M12
description: Data collection at infant's age of 12 months
source: LIFELINES_NEXT LIFELINES_NEXT Mothers
subpopulations: LIFELINES_NEXT LIFELINES_NEXT Mothers
source: LIFELINES_NEXT LIFELINES_NEXT Children
subpopulations: LIFELINES_NEXT LIFELINES_NEXT Children
keyword: Breast milk
keywords: Breast milk
keyword: Development
keywords: Development
keyword: Urine
keywords: Urine
keyword: Blood
keywords: Blood
keyword: Cord blood
keywords: Cord blood
keyword: Healthy ageing
keywords: Healthy ageing
keyword: Birth cohort
keywords: Birth cohort
keyword: Transgenerational effects
keywords: Transgenerational effects
keyword: Meconium
keywords: Meconium
keyword: Microbiome
keywords: Microbiome
keyword: Biobank
keywords: Biobank
keyword: Feces
keywords: Feces
start date: 2017-01-01
age groups: http://umcgresearchdatacatalogue.nl/CatalogueOntologies/api/rdf/AgeGroups/name=Young%20adult%20%2818-24%20years%29
age groups: http://umcgresearchdatacatalogue.nl/CatalogueOntologies/api/rdf/AgeGroups/name=Middle-aged%20%2845-64%20years%29
age groups: http://umcgresearchdatacatalogue.nl/CatalogueOntologies/api/rdf/AgeGroups/name=Adult%20%2825-44%20years%29
age groups: http://umcgresearchdatacatalogue.nl/CatalogueOntologies/api/rdf/AgeGroups/name=Infants%20and%20toddlers%20%282-23%20months%29
number of participants: 1450
areas of information: http://umcgresearchdatacatalogue.nl/CatalogueOntologies/api/rdf/AreasOfInformationCohorts/name=Medication%20and%20supplement%20intake
areas of information: http://umcgresearchdatacatalogue.nl/CatalogueOntologies/api/rdf/AreasOfInformationCohorts/name=Microbiology
areas of information: http://umcgresearchdatacatalogue.nl/CatalogueOntologies/api/rdf/AreasOfInformationCohorts/name=Sleep
areas of information: http://umcgresearchdatacatalogue.nl/CatalogueOntologies/api/rdf/AreasOfInformationCohorts/name=Life%20course%20development
areas of information: http://umcgresearchdatacatalogue.nl/CatalogueOntologies/api/rdf/AreasOfInformationCohorts/name=Perception%20of%20health
areas of information: http://umcgresearchdatacatalogue.nl/CatalogueOntologies/api/rdf/AreasOfInformationCohorts/name=Genomics
areas of information: http://umcgresearchdatacatalogue.nl/CatalogueOntologies/api/rdf/AreasOfInformationCohorts/name=Nutrition
areas of information: http://umcgresearchdatacatalogue.nl/CatalogueOntologies/api/rdf/AreasOfInformationCohorts/name=Breastfeeding
areas of information: http://umcgresearchdatacatalogue.nl/CatalogueOntologies/api/rdf/AreasOfInformationCohorts/name=Questionnaire%20and%20interview-related%20information
areas of information: http://umcgresearchdatacatalogue.nl/CatalogueOntologies/api/rdf/AreasOfInformationCohorts/name=Skin%20and%20subcutaneous%20tissue
data categories: http://umcgresearchdatacatalogue.nl/CatalogueOntologies/api/rdf/DataCategories/name=Biological%20samples
data categories: http://umcgresearchdatacatalogue.nl/CatalogueOntologies/api/rdf/DataCategories/name=Imaging%20data
data categories: http://umcgresearchdatacatalogue.nl/CatalogueOntologies/api/rdf/DataCategories/name=Survey%20data
data categories: http://umcgresearchdatacatalogue.nl/CatalogueOntologies/api/rdf/DataCategories/name=Genomics
sample categories: http://umcgresearchdatacatalogue.nl/CatalogueOntologies/api/rdf/SampleCategories/name=Blood%20Buffy%20Coat
sample categories: http://umcgresearchdatacatalogue.nl/CatalogueOntologies/api/rdf/SampleCategories/name=DNA
sample categories: http://umcgresearchdatacatalogue.nl/CatalogueOntologies/api/rdf/SampleCategories/name=Urine%2C%20random
sample categories: http://umcgresearchdatacatalogue.nl/CatalogueOntologies/api/rdf/SampleCategories/name=Feces
sample categories: http://umcgresearchdatacatalogue.nl/CatalogueOntologies/api/rdf/SampleCategories/name=Blood%20%28whole%29
sample categories: http://umcgresearchdatacatalogue.nl/CatalogueOntologies/api/rdf/SampleCategories/name=Nasal%20swabs
sample categories: http://umcgresearchdatacatalogue.nl/CatalogueOntologies/api/rdf/SampleCategories/name=Serum
sample categories: http://umcgresearchdatacatalogue.nl/CatalogueOntologies/api/rdf/SampleCategories/name=Mouth%20swabs
sample categories: http://umcgresearchdatacatalogue.nl/CatalogueOntologies/api/rdf/SampleCategories/name=Milk%2C%20Human
sample categories: http://umcgresearchdatacatalogue.nl/CatalogueOntologies/api/rdf/SampleCategories/name=Plasma
standardized tools: http://umcgresearchdatacatalogue.nl/CatalogueOntologies/api/rdf/StandardizedTools/name=Ages%20and%20Stages%20Questionnaire
standardized tools: http://umcgresearchdatacatalogue.nl/CatalogueOntologies/api/rdf/StandardizedTools/name=Rome%20III%20IBS%20Diagnostic%20Questionnaire
standardized tools: http://umcgresearchdatacatalogue.nl/CatalogueOntologies/api/rdf/StandardizedTools/name=Infant%20Gastrointestinal%20Symptom%20Questionnaire
standardized tools: http://umcgresearchdatacatalogue.nl/CatalogueOntologies/api/rdf/StandardizedTools/name=Food%20Frequency%20Questionnaire
standardized tools: http://umcgresearchdatacatalogue.nl/CatalogueOntologies/api/rdf/StandardizedTools/name=Brief%20Infant%20Toddler%20Social%20Emotional%20Assessment
standardized tools: http://umcgresearchdatacatalogue.nl/CatalogueOntologies/api/rdf/StandardizedTools/name=SCORing%20Atopic%20Dermatitus
standardized tools: http://umcgresearchdatacatalogue.nl/CatalogueOntologies/api/rdf/StandardizedTools/name=Infant%20Behavior%20Questionnaire
standardized tools: http://umcgresearchdatacatalogue.nl/CatalogueOntologies/api/rdf/StandardizedTools/name=Brief%20Infant%20Sleep%20Questionnaire
standardized tools: http://umcgresearchdatacatalogue.nl/CatalogueOntologies/api/rdf/StandardizedTools/name=Bayley%20Scales%20of%20Infant%20and%20Toddler%20Development
standardized tools other: Preventie en Incidentie van Astma en Mijt Allergie (PIAMA)
core variables: Growth charts

LIFELINES_NEXT LIFELINES_NEXT Inclusion
type: Collection events
type: Observation
endpoint URL: catalogue_rdf
data set: Collection events
source: LIFELINES_NEXT
resource: LIFELINES_NEXT
title: LIFELINES_NEXT Inclusion
name: LIFELINES_NEXT Inclusion
pid: https://umcgresearchdatacatalogue.nl/all/collections/LIFELINES_NEXT/collection-events/LIFELINES_NEXT%20Inclusion
description: Data collection at inclusion in LLNEXT
source: LIFELINES_NEXT LIFELINES_NEXT Children
subpopulations: LIFELINES_NEXT LIFELINES_NEXT Children
source: LIFELINES_NEXT LIFELINES_NEXT Partners
subpopulations: LIFELINES_NEXT LIFELINES_NEXT Partners
source: LIFELINES_NEXT LIFELINES_NEXT Mothers
subpopulations: LIFELINES_NEXT LIFELINES_NEXT Mothers
keyword: Breast milk
keywords: Breast milk
keyword: Development
keywords: Development
keyword: Urine
keywords: Urine
keyword: Blood
keywords: Blood
keyword: Cord blood
keywords: Cord blood
keyword: Healthy ageing
keywords: Healthy ageing
keyword: Birth cohort
keywords: Birth cohort
keyword: Transgenerational effects
keywords: Transgenerational effects
keyword: Meconium
keywords: Meconium
keyword: Microbiome
keywords: Microbiome
keyword: Biobank
keywords: Biobank
keyword: Feces
keywords: Feces
start date: 2016-01-01
number of participants: 1450
areas of information: http://umcgresearchdatacatalogue.nl/CatalogueOntologies/api/rdf/AreasOfInformationCohorts/name=Twin
areas of information: http://umcgresearchdatacatalogue.nl/CatalogueOntologies/api/rdf/AreasOfInformationCohorts/name=Pregnancy%2C%20delivery%20and%20birth
areas of information: http://umcgresearchdatacatalogue.nl/CatalogueOntologies/api/rdf/AreasOfInformationCohorts/name=Sex%2Fgender
areas of information: http://umcgresearchdatacatalogue.nl/CatalogueOntologies/api/rdf/AreasOfInformationCohorts/name=Residence
areas of information: http://umcgresearchdatacatalogue.nl/CatalogueOntologies/api/rdf/AreasOfInformationCohorts/name=Date%20and%20time-related%20information
areas of information: http://umcgresearchdatacatalogue.nl/CatalogueOntologies/api/rdf/AreasOfInformationCohorts/name=Age%2Fbirthdate
areas of information: http://umcgresearchdatacatalogue.nl/CatalogueOntologies/api/rdf/AreasOfInformationCohorts/name=Identifiers
data categories: http://umcgresearchdatacatalogue.nl/CatalogueOntologies/api/rdf/DataCategories/name=Other
contact point: LIFELINES_NEXT Lifelines NEXT Contact
publisher: LIFELINES_NEXT UMCG
creator: LIFELINES_NEXT UMCG
theme: http://umcgresearchdatacatalogue.nl/CatalogueOntologies/api/rdf/Themes/name=Health
theme: HEAL
access rights: http://umcgresearchdatacatalogue.nl/CatalogueOntologies/api/rdf/AccessRights/name=Non%20public
access rights: NON PUBLIC
applicable legislation: http://umcgresearchdatacatalogue.nl/CatalogueOntologies/api/rdf/Legislations/name=Data%20Governance%20Act
applicable legislation: oj
mg_draft: false
mg_insertedOn: 2026-05-13T12:02:11
mg_updatedOn: 2026-05-13T12:02:11

LIFELINES_NEXT LIFELINES_NEXT LLNEXT_Partners
type: Collection events
type: Observation
endpoint URL: catalogue_rdf
data set: Collection events
source: LIFELINES_NEXT
resource: LIFELINES_NEXT
title: LIFELINES_NEXT LLNEXT_Partners
name: LIFELINES_NEXT LLNEXT_Partners
pid: https://umcgresearchdatacatalogue.nl/all/collections/LIFELINES_NEXT/collection-events/LIFELINES_NEXT%20LLNEXT_Partners
description: Data collected from LLNEXT partners
source: LIFELINES_NEXT LIFELINES_NEXT Partners
subpopulations: LIFELINES_NEXT LIFELINES_NEXT Partners
keyword: Breast milk
keywords: Breast milk
keyword: Development
keywords: Development
keyword: Urine
keywords: Urine
keyword: Blood
keywords: Blood
keyword: Cord blood
keywords: Cord blood
keyword: Healthy ageing
keywords: Healthy ageing
keyword: Birth cohort
keywords: Birth cohort
keyword: Transgenerational effects
keywords: Transgenerational effects
keyword: Meconium
keywords: Meconium
keyword: Microbiome
keywords: Microbiome
keyword: Biobank
keywords: Biobank
keyword: Feces
keywords: Feces
age groups: http://umcgresearchdatacatalogue.nl/CatalogueOntologies/api/rdf/AgeGroups/name=Young%20adult%20%2818-24%20years%29
age groups: http://umcgresearchdatacatalogue.nl/CatalogueOntologies/api/rdf/AgeGroups/name=Middle-aged%20%2845-64%20years%29
age groups: http://umcgresearchdatacatalogue.nl/CatalogueOntologies/api/rdf/AgeGroups/name=Adult%20%2825-44%20years%29
number of participants: 840
areas of information: http://umcgresearchdatacatalogue.nl/CatalogueOntologies/api/rdf/AreasOfInformationCohorts/name=Family%20and%20household%20structure
areas of information: http://umcgresearchdatacatalogue.nl/CatalogueOntologies/api/rdf/AreasOfInformationCohorts/name=Life%20events
areas of information: http://umcgresearchdatacatalogue.nl/CatalogueOntologies/api/rdf/AreasOfInformationCohorts/name=Questionnaire%20and%20interview-related%20information
areas of information: http://umcgresearchdatacatalogue.nl/CatalogueOntologies/api/rdf/AreasOfInformationCohorts/name=Physical%20activity
areas of information: http://umcgresearchdatacatalogue.nl/CatalogueOntologies/api/rdf/AreasOfInformationCohorts/name=Nutrition
areas of information: http://umcgresearchdatacatalogue.nl/CatalogueOntologies/api/rdf/AreasOfInformationCohorts/name=Medication%20and%20supplement%20intake
areas of information: http://umcgresearchdatacatalogue.nl/CatalogueOntologies/api/rdf/AreasOfInformationCohorts/name=Tobacco
areas of information: http://umcgresearchdatacatalogue.nl/CatalogueOntologies/api/rdf/AreasOfInformationCohorts/name=Drugs
areas of information: http://umcgresearchdatacatalogue.nl/CatalogueOntologies/api/rdf/AreasOfInformationCohorts/name=Marital%2Fpartner%20status
areas of information: http://umcgresearchdatacatalogue.nl/CatalogueOntologies/api/rdf/AreasOfInformationCohorts/name=Income%2C%20possessions%2C%20and%20benefits
areas of information: http://umcgresearchdatacatalogue.nl/CatalogueOntologies/api/rdf/AreasOfInformationCohorts/name=Alcohol
areas of information: http://umcgresearchdatacatalogue.nl/CatalogueOntologies/api/rdf/AreasOfInformationCohorts/name=Genomics
areas of information: http://umcgresearchdatacatalogue.nl/CatalogueOntologies/api/rdf/AreasOfInformationCohorts/name=Perception%20of%20health
areas of information: http://umcgresearchdatacatalogue.nl/CatalogueOntologies/api/rdf/AreasOfInformationCohorts/name=Education
areas of information: http://umcgresearchdatacatalogue.nl/CatalogueOntologies/api/rdf/AreasOfInformationCohorts/name=Anthropometry
areas of information: http://umcgresearchdatacatalogue.nl/CatalogueOntologies/api/rdf/AreasOfInformationCohorts/name=Residence
data categories: http://umcgresearchdatacatalogue.nl/CatalogueOntologies/api/rdf/DataCategories/name=Survey%20data
data categories: http://umcgresearchdatacatalogue.nl/CatalogueOntologies/api/rdf/DataCategories/name=Biological%20samples
sample categories: http://umcgresearchdatacatalogue.nl/CatalogueOntologies/api/rdf/SampleCategories/name=Serum
sample categories: http://umcgresearchdatacatalogue.nl/CatalogueOntologies/api/rdf/SampleCategories/name=Blood%20Buffy%20Coat
sample categories: http://umcgresearchdatacatalogue.nl/CatalogueOntologies/api/rdf/SampleCategories/name=DNA
sample categories: http://umcgresearchdatacatalogue.nl/CatalogueOntologies/api/rdf/SampleCategories/name=RNA
sample categories: http://umcgresearchdatacatalogue.nl/CatalogueOntologies/api/rdf/SampleCategories/name=Plasma
sample categories: http://umcgresearchdatacatalogue.nl/CatalogueOntologies/api/rdf/SampleCategories/name=Blood%20%28whole%29
standardized tools: http://umcgresearchdatacatalogue.nl/CatalogueOntologies/api/rdf/StandardizedTools/name=Widespread%20Pain%20Index
standardized tools: http://umcgresearchdatacatalogue.nl/CatalogueOntologies/api/rdf/StandardizedTools/name=Long-term%20Difficulties%20Inventory
standardized tools: http://umcgresearchdatacatalogue.nl/CatalogueOntologies/api/rdf/StandardizedTools/name=Rome%20III%20IBS%20Diagnostic%20Questionnaire
standardized tools: http://umcgresearchdatacatalogue.nl/CatalogueOntologies/api/rdf/StandardizedTools/name=National%20Eye%20Institute%20Visual%20Function%20Questionnaire
standardized tools: http://umcgresearchdatacatalogue.nl/CatalogueOntologies/api/rdf/StandardizedTools/name=Symptom%20Checklist%2090
standardized tools: http://umcgresearchdatacatalogue.nl/CatalogueOntologies/api/rdf/StandardizedTools/name=Food%20Frequency%20Questionnaire
standardized tools: http://umcgresearchdatacatalogue.nl/CatalogueOntologies/api/rdf/StandardizedTools/name=List%20of%20Threatening%20Experiences
standardized tools: http://umcgresearchdatacatalogue.nl/CatalogueOntologies/api/rdf/StandardizedTools/name=The%20European%20Community%20Respiratory%20Health%20Survey
standardized tools: http://umcgresearchdatacatalogue.nl/CatalogueOntologies/api/rdf/StandardizedTools/name=Checklist%20Individuele%20Spankracht%20%2F%20Checklist%20Individual%20Strength
standardized tools: http://umcgresearchdatacatalogue.nl/CatalogueOntologies/api/rdf/StandardizedTools/name=Short%20QUestionnaire%20to%20ASsess%20Health-enhancing%20physical%20activity
contact point: LIFELINES_NEXT Lifelines NEXT Contact
publisher: LIFELINES_NEXT UMCG
creator: LIFELINES_NEXT UMCG
theme: http://umcgresearchdatacatalogue.nl/CatalogueOntologies/api/rdf/Themes/name=Health
theme: HEAL

LIFELINES_NEXT LIFELINES_NEXT M11
type: Collection events
type: Observation
endpoint URL: catalogue_rdf
data set: Collection events
source: LIFELINES_NEXT
resource: LIFELINES_NEXT
title: LIFELINES_NEXT M11
name: LIFELINES_NEXT M11
pid: https://umcgresearchdatacatalogue.nl/all/collections/LIFELINES_NEXT/collection-events/LIFELINES_NEXT%20M11
description: Data collection at infant's age of 11 months
source: LIFELINES_NEXT LIFELINES_NEXT Mothers
subpopulations: LIFELINES_NEXT LIFELINES_NEXT Mothers
source: LIFELINES_NEXT LIFELINES_NEXT Children
subpopulations: LIFELINES_NEXT LIFELINES_NEXT Children
keyword: Breast milk
keywords: Breast milk
keyword: Development
keywords: Development
keyword: Urine
keywords: Urine
keyword: Blood
keywords: Blood
keyword: Cord blood
keywords: Cord blood
keyword: Healthy ageing
keywords: Healthy ageing
keyword: Birth cohort
keywords: Birth cohort
keyword: Transgenerational effects
keywords: Transgenerational effects
keyword: Meconium
keywords: Meconium
keyword: Microbiome
keywords: Microbiome
keyword: Biobank
keywords: Biobank
keyword: Feces
keywords: Feces
start date: 2017-01-01
age groups: http://umcgresearchdatacatalogue.nl/CatalogueOntologies/api/rdf/AgeGroups/name=Young%20adult%20%2818-24%20years%29
age groups: http://umcgresearchdatacatalogue.nl/CatalogueOntologies/api/rdf/AgeGroups/name=Middle-aged%20%2845-64%20years%29
age groups: http://umcgresearchdatacatalogue.nl/CatalogueOntologies/api/rdf/AgeGroups/name=Adult%20%2825-44%20years%29
age groups: http://umcgresearchdatacatalogue.nl/CatalogueOntologies/api/rdf/AgeGroups/name=Infants%20and%20toddlers%20%282-23%20months%29
number of participants: 1450
areas of information: http://umcgresearchdatacatalogue.nl/CatalogueOntologies/api/rdf/AreasOfInformationCohorts/name=Parenting%20and%20familial%20environment
data categories: http://umcgresearchdatacatalogue.nl/CatalogueOntologies/api/rdf/DataCategories/name=Survey%20data
contact point: LIFELINES_NEXT Lifelines NEXT Contact
publisher: LIFELINES_NEXT UMCG
creator: LIFELINES_NEXT UMCG
theme: http://umcgresearchdatacatalogue.nl/CatalogueOntologies/api/rdf/Themes/name=Health
theme: HEAL
access rights: http://umcgresearchdatacatalogue.nl/CatalogueOntologies/api/rdf/AccessRights/name=Non%20public
access rights: NON PUBLIC
applicable legislation: http://umcgresearchdatacatalogue.nl/CatalogueOntologies/api/rdf/Legislations/name=Data%20Governance%20Act
applicable legislation: oj
mg_draft: false
mg_insertedOn: 2026-05-13T12:02:11
mg_updatedOn: 2026-05-13T12:02:11

LIFELINES_NEXT LIFELINES_NEXT P28
type: Collection events
type: Observation
endpoint URL: catalogue_rdf
data set: Collection events
source: LIFELINES_NEXT
resource: LIFELINES_NEXT
title: LIFELINES_NEXT P28
name: LIFELINES_NEXT P28
pid: https://umcgresearchdatacatalogue.nl/all/collections/LIFELINES_NEXT/collection-events/LIFELINES_NEXT%20P28
description: Data collection at gestational age of 28 weeks
source: LIFELINES_NEXT LIFELINES_NEXT Mothers
subpopulations: LIFELINES_NEXT LIFELINES_NEXT Mothers
keyword: Breast milk
keywords: Breast milk
keyword: Development
keywords: Development
keyword: Urine
keywords: Urine
keyword: Blood
keywords: Blood
keyword: Cord blood
keywords: Cord blood
keyword: Healthy ageing
keywords: Healthy ageing
keyword: Birth cohort
keywords: Birth cohort
keyword: Transgenerational effects
keywords: Transgenerational effects
keyword: Meconium
keywords: Meconium
keyword: Microbiome
keywords: Microbiome
keyword: Biobank
keywords: Biobank
keyword: Feces
keywords: Feces
start date: 2016-01-01
age groups: http://umcgresearchdatacatalogue.nl/CatalogueOntologies/api/rdf/AgeGroups/name=Young%20adult%20%2818-24%20years%29
age groups: http://umcgresearchdatacatalogue.nl/CatalogueOntologies/api/rdf/AgeGroups/name=Middle-aged%20%2845-64%20years%29
age groups: http://umcgresearchdatacatalogue.nl/CatalogueOntologies/api/rdf/AgeGroups/name=Adult%20%2825-44%20years%29
number of participants: 1450
areas of information: http://umcgresearchdatacatalogue.nl/CatalogueOntologies/api/rdf/AreasOfInformationCohorts/name=Microbiology
areas of information: http://umcgresearchdatacatalogue.nl/CatalogueOntologies/api/rdf/AreasOfInformationCohorts/name=Virology
areas of information: http://umcgresearchdatacatalogue.nl/CatalogueOntologies/api/rdf/AreasOfInformationCohorts/name=Perception%20of%20health
areas of information: http://umcgresearchdatacatalogue.nl/CatalogueOntologies/api/rdf/AreasOfInformationCohorts/name=Immunology
areas of information: http://umcgresearchdatacatalogue.nl/CatalogueOntologies/api/rdf/AreasOfInformationCohorts/name=Psychological%20distress%20and%20emotions
areas of information: http://umcgresearchdatacatalogue.nl/CatalogueOntologies/api/rdf/AreasOfInformationCohorts/name=Questionnaire%20and%20interview-related%20information
areas of information: http://umcgresearchdatacatalogue.nl/CatalogueOntologies/api/rdf/AreasOfInformationCohorts/name=Genomics
areas of information: http://umcgresearchdatacatalogue.nl/CatalogueOntologies/api/rdf/AreasOfInformationCohorts/name=Parenting%20and%20familial%20environment
areas of information: http://umcgresearchdatacatalogue.nl/CatalogueOntologies/api/rdf/AreasOfInformationCohorts/name=Social%20support
data categories: http://umcgresearchdatacatalogue.nl/CatalogueOntologies/api/rdf/DataCategories/name=Survey%20data
data categories: http://umcgresearchdatacatalogue.nl/CatalogueOntologies/api/rdf/DataCategories/name=Biological%20samples
data categories: http://umcgresearchdatacatalogue.nl/CatalogueOntologies/api/rdf/DataCategories/name=Genomics
data categories: http://umcgresearchdatacatalogue.nl/CatalogueOntologies/api/rdf/DataCategories/name=Metabolomics
data categories: http://umcgresearchdatacatalogue.nl/CatalogueOntologies/api/rdf/DataCategories/name=Proteomics
sample categories: http://umcgresearchdatacatalogue.nl/CatalogueOntologies/api/rdf/SampleCategories/name=DNA
sample categories: http://umcgresearchdatacatalogue.nl/CatalogueOntologies/api/rdf/SampleCategories/name=Plasma
sample categories: http://umcgresearchdatacatalogue.nl/CatalogueOntologies/api/rdf/SampleCategories/name=RNA
sample categories: http://umcgresearchdatacatalogue.nl/CatalogueOntologies/api/rdf/SampleCategories/name=Blood%20Buffy%20Coat
sample categories: http://umcgresearchdatacatalogue.nl/CatalogueOntologies/api/rdf/SampleCategories/name=Feces
sample categories: http://umcgresearchdatacatalogue.nl/CatalogueOntologies/api/rdf/SampleCategories/name=Blood%20%28whole%29
sample categories: http://umcgresearchdatacatalogue.nl/CatalogueOntologies/api/rdf/SampleCategories/name=Serum
standardized tools: http://umcgresearchdatacatalogue.nl/CatalogueOntologies/api/rdf/StandardizedTools/name=Multidimensional%20Scale%20of%20Perceived%20Social%20Support
standardized tools: http://umcgresearchdatacatalogue.nl/CatalogueOntologies/api/rdf/StandardizedTools/name=Maternal%20Antenatal%20Attachment%20Scale
standardized tools: http://umcgresearchdatacatalogue.nl/CatalogueOntologies/api/rdf/StandardizedTools/name=Sociale%20Steun%20Lijst%20%E2%80%93%20Interacties%20%2F%20Sociale%20Steun%20Lijst%20%E2%80%93%20Discrepanties%20%…
standardized tools: http://umcgresearchdatacatalogue.nl/CatalogueOntologies/api/rdf/StandardizedTools/name=Rome%20III%20IBS%20Diagnostic%20Questionnaire
standardized tools: http://umcgresearchdatacatalogue.nl/CatalogueOntologies/api/rdf/StandardizedTools/name=Mini%20International%20Neuropsychiatric%20Interview
contact point: LIFELINES_NEXT Lifelines NEXT Contact
publisher: LIFELINES_NEXT UMCG
creator: LIFELINES_NEXT UMCG
theme: http://umcgresearchdatacatalogue.nl/CatalogueOntologies/api/rdf/Themes/name=Health
theme: HEAL
access rights: http://umcgresearchdatacatalogue.nl/CatalogueOntologies/api/rdf/AccessRights/name=Non%20public
access rights: NON PUBLIC
applicable legislation: http://umcgresearchdatacatalogue.nl/CatalogueOntologies/api/rdf/Legislations/name=Data%20Governance%20Act
applicable legislation: oj
mg_draft: false
mg_insertedOn: 2026-05-13T12:02:11
mg_updatedOn: 2026-05-13T12:02:11

LIFELINES_NEXT LIFELINES_NEXT M5
type: Collection events
type: Observation
endpoint URL: catalogue_rdf
data set: Collection events
source: LIFELINES_NEXT
resource: LIFELINES_NEXT
title: LIFELINES_NEXT M5
name: LIFELINES_NEXT M5
pid: https://umcgresearchdatacatalogue.nl/all/collections/LIFELINES_NEXT/collection-events/LIFELINES_NEXT%20M5
description: Data collection at infant's age of 5 months
source: LIFELINES_NEXT LIFELINES_NEXT Mothers
subpopulations: LIFELINES_NEXT LIFELINES_NEXT Mothers
keyword: Breast milk
keywords: Breast milk
keyword: Development
keywords: Development
keyword: Urine
keywords: Urine
keyword: Blood
keywords: Blood
keyword: Cord blood
keywords: Cord blood
keyword: Healthy ageing
keywords: Healthy ageing
keyword: Birth cohort
keywords: Birth cohort
keyword: Transgenerational effects
keywords: Transgenerational effects
keyword: Meconium
keywords: Meconium
keyword: Microbiome
keywords: Microbiome
keyword: Biobank
keywords: Biobank
keyword: Feces
keywords: Feces
start date: 2017-01-01
age groups: http://umcgresearchdatacatalogue.nl/CatalogueOntologies/api/rdf/AgeGroups/name=Young%20adult%20%2818-24%20years%29
age groups: http://umcgresearchdatacatalogue.nl/CatalogueOntologies/api/rdf/AgeGroups/name=Middle-aged%20%2845-64%20years%29
age groups: http://umcgresearchdatacatalogue.nl/CatalogueOntologies/api/rdf/AgeGroups/name=Adult%20%2825-44%20years%29
number of participants: 1450
areas of information: http://umcgresearchdatacatalogue.nl/CatalogueOntologies/api/rdf/AreasOfInformationCohorts/name=Questionnaire%20and%20interview-related%20information
areas of information: http://umcgresearchdatacatalogue.nl/CatalogueOntologies/api/rdf/AreasOfInformationCohorts/name=Social%20support
areas of information: http://umcgresearchdatacatalogue.nl/CatalogueOntologies/api/rdf/AreasOfInformationCohorts/name=Psychological%20distress%20and%20emotions
data categories: http://umcgresearchdatacatalogue.nl/CatalogueOntologies/api/rdf/DataCategories/name=Survey%20data
standardized tools: http://umcgresearchdatacatalogue.nl/CatalogueOntologies/api/rdf/StandardizedTools/name=Maternal%20Postnal%20Attachment%20Scale
standardized tools: http://umcgresearchdatacatalogue.nl/CatalogueOntologies/api/rdf/StandardizedTools/name=Mini%20International%20Neuropsychiatric%20Interview
standardized tools: http://umcgresearchdatacatalogue.nl/CatalogueOntologies/api/rdf/StandardizedTools/name=Multidimensional%20Scale%20of%20Perceived%20Social%20Support
standardized tools: http://umcgresearchdatacatalogue.nl/CatalogueOntologies/api/rdf/StandardizedTools/name=Sociale%20Steun%20Lijst%20%E2%80%93%20Interacties%20%2F%20Sociale%20Steun%20Lijst%20%E2%80%93%20Discrepanties%20%…
contact point: LIFELINES_NEXT Lifelines NEXT Contact
publisher: LIFELINES_NEXT UMCG
creator: LIFELINES_NEXT UMCG
theme: http://umcgresearchdatacatalogue.nl/CatalogueOntologies/api/rdf/Themes/name=Health
theme: HEAL
access rights: http://umcgresearchdatacatalogue.nl/CatalogueOntologies/api/rdf/AccessRights/name=Non%20public
access rights: NON PUBLIC
applicable legislation: http://umcgresearchdatacatalogue.nl/CatalogueOntologies/api/rdf/Legislations/name=Data%20Governance%20Act
applicable legislation: oj
mg_draft: false
mg_insertedOn: 2026-05-13T12:02:11
mg_updatedOn: 2026-05-13T12:02:11

LIFELINES_NEXT LIFELINES_NEXT M3
type: Collection events
type: Observation
endpoint URL: catalogue_rdf
data set: Collection events
source: LIFELINES_NEXT
resource: LIFELINES_NEXT
title: LIFELINES_NEXT M3
name: LIFELINES_NEXT M3
pid: https://umcgresearchdatacatalogue.nl/all/collections/LIFELINES_NEXT/collection-events/LIFELINES_NEXT%20M3
description: Data collection at infant's age of 3 months
source: LIFELINES_NEXT LIFELINES_NEXT Mothers
subpopulations: LIFELINES_NEXT LIFELINES_NEXT Mothers
source: LIFELINES_NEXT LIFELINES_NEXT Children
subpopulations: LIFELINES_NEXT LIFELINES_NEXT Children
keyword: Breast milk
keywords: Breast milk
keyword: Development
keywords: Development
keyword: Urine
keywords: Urine
keyword: Blood
keywords: Blood
keyword: Cord blood
keywords: Cord blood
keyword: Healthy ageing
keywords: Healthy ageing
keyword: Birth cohort
keywords: Birth cohort
keyword: Transgenerational effects
keywords: Transgenerational effects
keyword: Meconium
keywords: Meconium
keyword: Microbiome
keywords: Microbiome
keyword: Biobank
keywords: Biobank
keyword: Feces
keywords: Feces
start date: 2017-01-01
age groups: http://umcgresearchdatacatalogue.nl/CatalogueOntologies/api/rdf/AgeGroups/name=Young%20adult%20%2818-24%20years%29
age groups: http://umcgresearchdatacatalogue.nl/CatalogueOntologies/api/rdf/AgeGroups/name=Middle-aged%20%2845-64%20years%29
age groups: http://umcgresearchdatacatalogue.nl/CatalogueOntologies/api/rdf/AgeGroups/name=Adult%20%2825-44%20years%29
age groups: http://umcgresearchdatacatalogue.nl/CatalogueOntologies/api/rdf/AgeGroups/name=Infants%20and%20toddlers%20%282-23%20months%29
number of participants: 1450
areas of information: http://umcgresearchdatacatalogue.nl/CatalogueOntologies/api/rdf/AreasOfInformationCohorts/name=Immunology
areas of information: http://umcgresearchdatacatalogue.nl/CatalogueOntologies/api/rdf/AreasOfInformationCohorts/name=Medication%20and%20supplement%20intake
areas of information: http://umcgresearchdatacatalogue.nl/CatalogueOntologies/api/rdf/AreasOfInformationCohorts/name=Microbiology
areas of information: http://umcgresearchdatacatalogue.nl/CatalogueOntologies/api/rdf/AreasOfInformationCohorts/name=Perception%20of%20health
areas of information: http://umcgresearchdatacatalogue.nl/CatalogueOntologies/api/rdf/AreasOfInformationCohorts/name=Genomics
areas of information: http://umcgresearchdatacatalogue.nl/CatalogueOntologies/api/rdf/AreasOfInformationCohorts/name=Nutrition
areas of information: http://umcgresearchdatacatalogue.nl/CatalogueOntologies/api/rdf/AreasOfInformationCohorts/name=Breastfeeding
areas of information: http://umcgresearchdatacatalogue.nl/CatalogueOntologies/api/rdf/AreasOfInformationCohorts/name=Psychological%20distress%20and%20emotions
areas of information: http://umcgresearchdatacatalogue.nl/CatalogueOntologies/api/rdf/AreasOfInformationCohorts/name=Questionnaire%20and%20interview-related%20information
areas of information: http://umcgresearchdatacatalogue.nl/CatalogueOntologies/api/rdf/AreasOfInformationCohorts/name=Skin%20and%20subcutaneous%20tissue
data categories: http://umcgresearchdatacatalogue.nl/CatalogueOntologies/api/rdf/DataCategories/name=Genomics
data categories: http://umcgresearchdatacatalogue.nl/CatalogueOntologies/api/rdf/DataCategories/name=Biological%20samples
data categories: http://umcgresearchdatacatalogue.nl/CatalogueOntologies/api/rdf/DataCategories/name=Survey%20data
sample categories: http://umcgresearchdatacatalogue.nl/CatalogueOntologies/api/rdf/SampleCategories/name=Other%20epithelium
sample categories: http://umcgresearchdatacatalogue.nl/CatalogueOntologies/api/rdf/SampleCategories/name=Plasma
sample categories: http://umcgresearchdatacatalogue.nl/CatalogueOntologies/api/rdf/SampleCategories/name=Blood%20%28whole%29
sample categories: http://umcgresearchdatacatalogue.nl/CatalogueOntologies/api/rdf/SampleCategories/name=Nasal%20swabs
sample categories: http://umcgresearchdatacatalogue.nl/CatalogueOntologies/api/rdf/SampleCategories/name=Mouth%20swabs
sample categories: http://umcgresearchdatacatalogue.nl/CatalogueOntologies/api/rdf/SampleCategories/name=Serum
sample categories: http://umcgresearchdatacatalogue.nl/CatalogueOntologies/api/rdf/SampleCategories/name=RNA
sample categories: http://umcgresearchdatacatalogue.nl/CatalogueOntologies/api/rdf/SampleCategories/name=Blood%20Buffy%20Coat
sample categories: http://umcgresearchdatacatalogue.nl/CatalogueOntologies/api/rdf/SampleCategories/name=Milk%2C%20Human
sample categories: http://umcgresearchdatacatalogue.nl/CatalogueOntologies/api/rdf/SampleCategories/name=DNA
sample categories: http://umcgresearchdatacatalogue.nl/CatalogueOntologies/api/rdf/SampleCategories/name=Urine%2C%20random
sample categories: http://umcgresearchdatacatalogue.nl/CatalogueOntologies/api/rdf/SampleCategories/name=Feces
standardized tools: http://umcgresearchdatacatalogue.nl/CatalogueOntologies/api/rdf/StandardizedTools/name=SCORing%20Atopic%20Dermatitus
standardized tools: http://umcgresearchdatacatalogue.nl/CatalogueOntologies/api/rdf/StandardizedTools/name=Infant%20Gastrointestinal%20Symptom%20Questionnaire
standardized tools: http://umcgresearchdatacatalogue.nl/CatalogueOntologies/api/rdf/StandardizedTools/name=Food%20Frequency%20Questionnaire
standardized tools: http://umcgresearchdatacatalogue.nl/CatalogueOntologies/api/rdf/StandardizedTools/name=Home%20Observation%20for%20Measurement%20of%20Environment
standardized tools: http://umcgresearchdatacatalogue.nl/CatalogueOntologies/api/rdf/StandardizedTools/name=Rome%20III%20IBS%20Diagnostic%20Questionnaire
standardized tools: http://umcgresearchdatacatalogue.nl/CatalogueOntologies/api/rdf/StandardizedTools/name=Parenting%20Stress%20Index
core variables: Stratum corneum
contact point: LIFELINES_NEXT Lifelines NEXT Contact
publisher: LIFELINES_NEXT UMCG
creator: LIFELINES_NEXT UMCG

LIFELINES_NEXT LIFELINES_NEXT Y2
type: Collection events
type: Observation
endpoint URL: catalogue_rdf
data set: Collection events
source: LIFELINES_NEXT
resource: LIFELINES_NEXT
title: LIFELINES_NEXT Y2
name: LIFELINES_NEXT Y2
pid: https://umcgresearchdatacatalogue.nl/all/collections/LIFELINES_NEXT/collection-events/LIFELINES_NEXT%20Y2
description: Data collection at infant's age of 2 years
source: LIFELINES_NEXT LIFELINES_NEXT Children
subpopulations: LIFELINES_NEXT LIFELINES_NEXT Children
keyword: Breast milk
keywords: Breast milk
keyword: Development
keywords: Development
keyword: Urine
keywords: Urine
keyword: Blood
keywords: Blood
keyword: Cord blood
keywords: Cord blood
keyword: Healthy ageing
keywords: Healthy ageing
keyword: Birth cohort
keywords: Birth cohort
keyword: Transgenerational effects
keywords: Transgenerational effects
keyword: Meconium
keywords: Meconium
keyword: Microbiome
keywords: Microbiome
keyword: Biobank
keywords: Biobank
keyword: Feces
keywords: Feces
start date: 2022-01-01
age groups: http://umcgresearchdatacatalogue.nl/CatalogueOntologies/api/rdf/AgeGroups/name=Child%20%282-12%20years%29
number of participants: 1380
areas of information: http://umcgresearchdatacatalogue.nl/CatalogueOntologies/api/rdf/AreasOfInformationCohorts/name=Life%20course%20development
areas of information: http://umcgresearchdatacatalogue.nl/CatalogueOntologies/api/rdf/AreasOfInformationCohorts/name=Microbiology
areas of information: http://umcgresearchdatacatalogue.nl/CatalogueOntologies/api/rdf/AreasOfInformationCohorts/name=Perception%20of%20health
areas of information: http://umcgresearchdatacatalogue.nl/CatalogueOntologies/api/rdf/AreasOfInformationCohorts/name=Psychological%20distress%20and%20emotions
areas of information: http://umcgresearchdatacatalogue.nl/CatalogueOntologies/api/rdf/AreasOfInformationCohorts/name=Questionnaire%20and%20interview-related%20information
areas of information: http://umcgresearchdatacatalogue.nl/CatalogueOntologies/api/rdf/AreasOfInformationCohorts/name=Life%20events
areas of information: http://umcgresearchdatacatalogue.nl/CatalogueOntologies/api/rdf/AreasOfInformationCohorts/name=Parenting%20and%20familial%20environment
areas of information: http://umcgresearchdatacatalogue.nl/CatalogueOntologies/api/rdf/AreasOfInformationCohorts/name=Nutrition
areas of information: http://umcgresearchdatacatalogue.nl/CatalogueOntologies/api/rdf/AreasOfInformationCohorts/name=Medication%20and%20supplement%20intake
data categories: http://umcgresearchdatacatalogue.nl/CatalogueOntologies/api/rdf/DataCategories/name=Genomics
data categories: http://umcgresearchdatacatalogue.nl/CatalogueOntologies/api/rdf/DataCategories/name=Biological%20samples
data categories: http://umcgresearchdatacatalogue.nl/CatalogueOntologies/api/rdf/DataCategories/name=Survey%20data
sample categories: http://umcgresearchdatacatalogue.nl/CatalogueOntologies/api/rdf/SampleCategories/name=Feces
standardized tools: http://umcgresearchdatacatalogue.nl/CatalogueOntologies/api/rdf/StandardizedTools/name=International%20Study%20of%20Asthma%20and%20Allergies%20in%20Childhood%20Questionnaires
standardized tools: http://umcgresearchdatacatalogue.nl/CatalogueOntologies/api/rdf/StandardizedTools/name=Brief%20Infant%20Toddler%20Social%20Emotional%20Assessment
standardized tools: http://umcgresearchdatacatalogue.nl/CatalogueOntologies/api/rdf/StandardizedTools/name=Food%20Frequency%20Questionnaire
standardized tools: http://umcgresearchdatacatalogue.nl/CatalogueOntologies/api/rdf/StandardizedTools/name=Long-term%20Difficulties%20Inventory
standardized tools: http://umcgresearchdatacatalogue.nl/CatalogueOntologies/api/rdf/StandardizedTools/name=List%20of%20Threatening%20Experiences
standardized tools other: ROME IV IBS Diagnostic Questionnaire
contact point: LIFELINES_NEXT Lifelines NEXT Contact
publisher: LIFELINES_NEXT UMCG
creator: LIFELINES_NEXT UMCG
theme: http://umcgresearchdatacatalogue.nl/CatalogueOntologies/api/rdf/Themes/name=Health
theme: HEAL
access rights: http://umcgresearchdatacatalogue.nl/CatalogueOntologies/api/rdf/AccessRights/name=Non%20public
access rights: NON PUBLIC
applicable legislation: http://umcgresearchdatacatalogue.nl/CatalogueOntologies/api/rdf/Legislations/name=Data%20Governance%20Act
applicable legislation: oj
mg_draft: false
mg_insertedOn: 2026-05-13T12:02:11
mg_updatedOn: 2026-05-13T12:02:11

LIFELINES_NEXT LIFELINES_NEXT Y2.5
type: Collection events
type: Observation
endpoint URL: catalogue_rdf
data set: Collection events
source: LIFELINES_NEXT
resource: LIFELINES_NEXT
title: LIFELINES_NEXT Y2.5
name: LIFELINES_NEXT Y2.5
pid: https://umcgresearchdatacatalogue.nl/all/collections/LIFELINES_NEXT/collection-events/LIFELINES_NEXT%20Y2.5
description: Data collection at infant's age of 2.5 years
source: LIFELINES_NEXT LIFELINES_NEXT Children
subpopulations: LIFELINES_NEXT LIFELINES_NEXT Children
keyword: Breast milk
keywords: Breast milk
keyword: Development
keywords: Development
keyword: Urine
keywords: Urine
keyword: Blood
keywords: Blood
keyword: Cord blood
keywords: Cord blood
keyword: Healthy ageing
keywords: Healthy ageing
keyword: Birth cohort
keywords: Birth cohort
keyword: Transgenerational effects
keywords: Transgenerational effects
keyword: Meconium
keywords: Meconium
keyword: Microbiome
keywords: Microbiome
keyword: Biobank
keywords: Biobank
keyword: Feces
keywords: Feces
start date: 2022-01-01
age groups: http://umcgresearchdatacatalogue.nl/CatalogueOntologies/api/rdf/AgeGroups/name=Child%20%282-12%20years%29
number of participants: 1380
areas of information: http://umcgresearchdatacatalogue.nl/CatalogueOntologies/api/rdf/AreasOfInformationCohorts/name=Questionnaire%20and%20interview-related%20information
areas of information: http://umcgresearchdatacatalogue.nl/CatalogueOntologies/api/rdf/AreasOfInformationCohorts/name=Life%20course%20development
data categories: http://umcgresearchdatacatalogue.nl/CatalogueOntologies/api/rdf/DataCategories/name=Survey%20data
standardized tools: http://umcgresearchdatacatalogue.nl/CatalogueOntologies/api/rdf/StandardizedTools/name=Ages%20and%20Stages%20Questionnaire
contact point: LIFELINES_NEXT Lifelines NEXT Contact
publisher: LIFELINES_NEXT UMCG
creator: LIFELINES_NEXT UMCG
theme: http://umcgresearchdatacatalogue.nl/CatalogueOntologies/api/rdf/Themes/name=Health
theme: HEAL
access rights: http://umcgresearchdatacatalogue.nl/CatalogueOntologies/api/rdf/AccessRights/name=Non%20public
access rights: NON PUBLIC
applicable legislation: http://umcgresearchdatacatalogue.nl/CatalogueOntologies/api/rdf/Legislations/name=Data%20Governance%20Act
applicable legislation: oj
mg_draft: false
mg_insertedOn: 2026-05-13T12:02:11
mg_updatedOn: 2026-05-13T12:02:11

LIFELINES_NEXT LIFELINES_NEXT Y4
type: Collection events
type: Observation
endpoint URL: catalogue_rdf
data set: Collection events
source: LIFELINES_NEXT
resource: LIFELINES_NEXT
title: LIFELINES_NEXT Y4
name: LIFELINES_NEXT Y4
pid: https://umcgresearchdatacatalogue.nl/all/collections/LIFELINES_NEXT/collection-events/LIFELINES_NEXT%20Y4
description: Data collection at infant's age of 4 years
source: LIFELINES_NEXT LIFELINES_NEXT Children
subpopulations: LIFELINES_NEXT LIFELINES_NEXT Children
keyword: Breast milk
keywords: Breast milk
keyword: Development
keywords: Development
keyword: Urine
keywords: Urine
keyword: Blood
keywords: Blood
keyword: Cord blood
keywords: Cord blood
keyword: Healthy ageing
keywords: Healthy ageing
keyword: Birth cohort
keywords: Birth cohort
keyword: Transgenerational effects
keywords: Transgenerational effects
keyword: Meconium
keywords: Meconium
keyword: Microbiome
keywords: Microbiome
keyword: Biobank
keywords: Biobank
keyword: Feces
keywords: Feces
start date: 2022-01-01
age groups: http://umcgresearchdatacatalogue.nl/CatalogueOntologies/api/rdf/AgeGroups/name=Child%20%282-12%20years%29
number of participants: 1380
areas of information: http://umcgresearchdatacatalogue.nl/CatalogueOntologies/api/rdf/AreasOfInformationCohorts/name=Life%20course%20development
areas of information: http://umcgresearchdatacatalogue.nl/CatalogueOntologies/api/rdf/AreasOfInformationCohorts/name=Microbiology
areas of information: http://umcgresearchdatacatalogue.nl/CatalogueOntologies/api/rdf/AreasOfInformationCohorts/name=Perception%20of%20health
areas of information: http://umcgresearchdatacatalogue.nl/CatalogueOntologies/api/rdf/AreasOfInformationCohorts/name=Psychological%20distress%20and%20emotions
areas of information: http://umcgresearchdatacatalogue.nl/CatalogueOntologies/api/rdf/AreasOfInformationCohorts/name=Questionnaire%20and%20interview-related%20information
areas of information: http://umcgresearchdatacatalogue.nl/CatalogueOntologies/api/rdf/AreasOfInformationCohorts/name=Life%20events
areas of information: http://umcgresearchdatacatalogue.nl/CatalogueOntologies/api/rdf/AreasOfInformationCohorts/name=Parenting%20and%20familial%20environment
areas of information: http://umcgresearchdatacatalogue.nl/CatalogueOntologies/api/rdf/AreasOfInformationCohorts/name=Nutrition
areas of information: http://umcgresearchdatacatalogue.nl/CatalogueOntologies/api/rdf/AreasOfInformationCohorts/name=Medication%20and%20supplement%20intake
data categories: http://umcgresearchdatacatalogue.nl/CatalogueOntologies/api/rdf/DataCategories/name=Genomics
data categories: http://umcgresearchdatacatalogue.nl/CatalogueOntologies/api/rdf/DataCategories/name=Biological%20samples
data categories: http://umcgresearchdatacatalogue.nl/CatalogueOntologies/api/rdf/DataCategories/name=Survey%20data
sample categories: http://umcgresearchdatacatalogue.nl/CatalogueOntologies/api/rdf/SampleCategories/name=Feces
standardized tools: http://umcgresearchdatacatalogue.nl/CatalogueOntologies/api/rdf/StandardizedTools/name=International%20Study%20of%20Asthma%20and%20Allergies%20in%20Childhood%20Questionnaires
standardized tools: http://umcgresearchdatacatalogue.nl/CatalogueOntologies/api/rdf/StandardizedTools/name=Strengths%20and%20Difficulties%20Questionnaire
standardized tools: http://umcgresearchdatacatalogue.nl/CatalogueOntologies/api/rdf/StandardizedTools/name=Food%20Frequency%20Questionnaire
standardized tools: http://umcgresearchdatacatalogue.nl/CatalogueOntologies/api/rdf/StandardizedTools/name=Long-term%20Difficulties%20Inventory
standardized tools: http://umcgresearchdatacatalogue.nl/CatalogueOntologies/api/rdf/StandardizedTools/name=List%20of%20Threatening%20Experiences
standardized tools other: ROME IV IBS Diagnostic Questionnaire
contact point: LIFELINES_NEXT Lifelines NEXT Contact
publisher: LIFELINES_NEXT UMCG
creator: LIFELINES_NEXT UMCG
theme: http://umcgresearchdatacatalogue.nl/CatalogueOntologies/api/rdf/Themes/name=Health
theme: HEAL
access rights: http://umcgresearchdatacatalogue.nl/CatalogueOntologies/api/rdf/AccessRights/name=Non%20public
access rights: NON PUBLIC
applicable legislation: http://umcgresearchdatacatalogue.nl/CatalogueOntologies/api/rdf/Legislations/name=Data%20Governance%20Act
applicable legislation: oj
mg_draft: false
mg_insertedOn: 2026-05-13T12:02:11
mg_updatedOn: 2026-05-13T12:02:11

LIFELINES_NEXT LIFELINES_NEXT Y5
type: Collection events
type: Observation
endpoint URL: catalogue_rdf
data set: Collection events
source: LIFELINES_NEXT
resource: LIFELINES_NEXT
title: LIFELINES_NEXT Y5
name: LIFELINES_NEXT Y5
pid: https://umcgresearchdatacatalogue.nl/all/collections/LIFELINES_NEXT/collection-events/LIFELINES_NEXT%20Y5
description: Data collection at infant's age of 5 years
source: LIFELINES_NEXT LIFELINES_NEXT Children
subpopulations: LIFELINES_NEXT LIFELINES_NEXT Children
keyword: Breast milk
keywords: Breast milk
keyword: Development
keywords: Development
keyword: Urine
keywords: Urine
keyword: Blood
keywords: Blood
keyword: Cord blood
keywords: Cord blood
keyword: Healthy ageing
keywords: Healthy ageing
keyword: Birth cohort
keywords: Birth cohort
keyword: Transgenerational effects
keywords: Transgenerational effects
keyword: Meconium
keywords: Meconium
keyword: Microbiome
keywords: Microbiome
keyword: Biobank
keywords: Biobank
keyword: Feces
keywords: Feces
start date: 2022-01-01
age groups: http://umcgresearchdatacatalogue.nl/CatalogueOntologies/api/rdf/AgeGroups/name=Child%20%282-12%20years%29
number of participants: 1380
areas of information: http://umcgresearchdatacatalogue.nl/CatalogueOntologies/api/rdf/AreasOfInformationCohorts/name=Life%20course%20development
areas of information: http://umcgresearchdatacatalogue.nl/CatalogueOntologies/api/rdf/AreasOfInformationCohorts/name=Microbiology
areas of information: http://umcgresearchdatacatalogue.nl/CatalogueOntologies/api/rdf/AreasOfInformationCohorts/name=Perception%20of%20health
areas of information: http://umcgresearchdatacatalogue.nl/CatalogueOntologies/api/rdf/AreasOfInformationCohorts/name=Psychological%20distress%20and%20emotions
areas of information: http://umcgresearchdatacatalogue.nl/CatalogueOntologies/api/rdf/AreasOfInformationCohorts/name=Questionnaire%20and%20interview-related%20information
areas of information: http://umcgresearchdatacatalogue.nl/CatalogueOntologies/api/rdf/AreasOfInformationCohorts/name=Life%20events
areas of information: http://umcgresearchdatacatalogue.nl/CatalogueOntologies/api/rdf/AreasOfInformationCohorts/name=Parenting%20and%20familial%20environment
areas of information: http://umcgresearchdatacatalogue.nl/CatalogueOntologies/api/rdf/AreasOfInformationCohorts/name=Nutrition
areas of information: http://umcgresearchdatacatalogue.nl/CatalogueOntologies/api/rdf/AreasOfInformationCohorts/name=Medication%20and%20supplement%20intake
data categories: http://umcgresearchdatacatalogue.nl/CatalogueOntologies/api/rdf/DataCategories/name=Genomics
data categories: http://umcgresearchdatacatalogue.nl/CatalogueOntologies/api/rdf/DataCategories/name=Biological%20samples
data categories: http://umcgresearchdatacatalogue.nl/CatalogueOntologies/api/rdf/DataCategories/name=Survey%20data
sample categories: http://umcgresearchdatacatalogue.nl/CatalogueOntologies/api/rdf/SampleCategories/name=Feces
standardized tools: http://umcgresearchdatacatalogue.nl/CatalogueOntologies/api/rdf/StandardizedTools/name=International%20Study%20of%20Asthma%20and%20Allergies%20in%20Childhood%20Questionnaires
standardized tools: http://umcgresearchdatacatalogue.nl/CatalogueOntologies/api/rdf/StandardizedTools/name=Strengths%20and%20Difficulties%20Questionnaire
standardized tools: http://umcgresearchdatacatalogue.nl/CatalogueOntologies/api/rdf/StandardizedTools/name=Food%20Frequency%20Questionnaire
standardized tools: http://umcgresearchdatacatalogue.nl/CatalogueOntologies/api/rdf/StandardizedTools/name=Long-term%20Difficulties%20Inventory
standardized tools: http://umcgresearchdatacatalogue.nl/CatalogueOntologies/api/rdf/StandardizedTools/name=List%20of%20Threatening%20Experiences
standardized tools other: ROME IV IBS Diagnostic Questionnaire
contact point: LIFELINES_NEXT Lifelines NEXT Contact
publisher: LIFELINES_NEXT UMCG
creator: LIFELINES_NEXT UMCG
theme: http://umcgresearchdatacatalogue.nl/CatalogueOntologies/api/rdf/Themes/name=Health
theme: HEAL
access rights: http://umcgresearchdatacatalogue.nl/CatalogueOntologies/api/rdf/AccessRights/name=Non%20public
access rights: NON PUBLIC
applicable legislation: http://umcgresearchdatacatalogue.nl/CatalogueOntologies/api/rdf/Legislations/name=Data%20Governance%20Act
applicable legislation: oj
mg_draft: false
mg_insertedOn: 2026-05-13T12:02:11
mg_updatedOn: 2026-05-13T12:02:11

LIFELINES_NEXT LIFELINES_NEXT Y6
type: Collection events
type: Observation
endpoint URL: catalogue_rdf
data set: Collection events
source: LIFELINES_NEXT
resource: LIFELINES_NEXT
title: LIFELINES_NEXT Y6
name: LIFELINES_NEXT Y6
pid: https://umcgresearchdatacatalogue.nl/all/collections/LIFELINES_NEXT/collection-events/LIFELINES_NEXT%20Y6
description: Data collection at infant's age of 6 years
source: LIFELINES_NEXT LIFELINES_NEXT Children
subpopulations: LIFELINES_NEXT LIFELINES_NEXT Children
keyword: Breast milk
keywords: Breast milk
keyword: Development
keywords: Development
keyword: Urine
keywords: Urine
keyword: Blood
keywords: Blood
keyword: Cord blood
keywords: Cord blood
keyword: Healthy ageing
keywords: Healthy ageing
keyword: Birth cohort
keywords: Birth cohort
keyword: Transgenerational effects
keywords: Transgenerational effects
keyword: Meconium
keywords: Meconium
keyword: Microbiome
keywords: Microbiome
keyword: Biobank
keywords: Biobank
keyword: Feces
keywords: Feces
start date: 2022-01-01
age groups: http://umcgresearchdatacatalogue.nl/CatalogueOntologies/api/rdf/AgeGroups/name=Child%20%282-12%20years%29
number of participants: 1380
areas of information: http://umcgresearchdatacatalogue.nl/CatalogueOntologies/api/rdf/AreasOfInformationCohorts/name=Life%20course%20development
areas of information: http://umcgresearchdatacatalogue.nl/CatalogueOntologies/api/rdf/AreasOfInformationCohorts/name=Microbiology
areas of information: http://umcgresearchdatacatalogue.nl/CatalogueOntologies/api/rdf/AreasOfInformationCohorts/name=Perception%20of%20health
areas of information: http://umcgresearchdatacatalogue.nl/CatalogueOntologies/api/rdf/AreasOfInformationCohorts/name=Psychological%20distress%20and%20emotions
areas of information: http://umcgresearchdatacatalogue.nl/CatalogueOntologies/api/rdf/AreasOfInformationCohorts/name=Questionnaire%20and%20interview-related%20information
areas of information: http://umcgresearchdatacatalogue.nl/CatalogueOntologies/api/rdf/AreasOfInformationCohorts/name=Life%20events
areas of information: http://umcgresearchdatacatalogue.nl/CatalogueOntologies/api/rdf/AreasOfInformationCohorts/name=Parenting%20and%20familial%20environment
areas of information: http://umcgresearchdatacatalogue.nl/CatalogueOntologies/api/rdf/AreasOfInformationCohorts/name=Nutrition
areas of information: http://umcgresearchdatacatalogue.nl/CatalogueOntologies/api/rdf/AreasOfInformationCohorts/name=Medication%20and%20supplement%20intake
data categories: http://umcgresearchdatacatalogue.nl/CatalogueOntologies/api/rdf/DataCategories/name=Genomics
data categories: http://umcgresearchdatacatalogue.nl/CatalogueOntologies/api/rdf/DataCategories/name=Biological%20samples
data categories: http://umcgresearchdatacatalogue.nl/CatalogueOntologies/api/rdf/DataCategories/name=Survey%20data
sample categories: http://umcgresearchdatacatalogue.nl/CatalogueOntologies/api/rdf/SampleCategories/name=Feces
standardized tools: http://umcgresearchdatacatalogue.nl/CatalogueOntologies/api/rdf/StandardizedTools/name=International%20Study%20of%20Asthma%20and%20Allergies%20in%20Childhood%20Questionnaires
standardized tools: http://umcgresearchdatacatalogue.nl/CatalogueOntologies/api/rdf/StandardizedTools/name=Strengths%20and%20Difficulties%20Questionnaire
standardized tools: http://umcgresearchdatacatalogue.nl/CatalogueOntologies/api/rdf/StandardizedTools/name=Food%20Frequency%20Questionnaire
standardized tools: http://umcgresearchdatacatalogue.nl/CatalogueOntologies/api/rdf/StandardizedTools/name=Long-term%20Difficulties%20Inventory
standardized tools: http://umcgresearchdatacatalogue.nl/CatalogueOntologies/api/rdf/StandardizedTools/name=List%20of%20Threatening%20Experiences
standardized tools other: ROME IV IBS Diagnostic Questionnaire
contact point: LIFELINES_NEXT Lifelines NEXT Contact
publisher: LIFELINES_NEXT UMCG
creator: LIFELINES_NEXT UMCG
theme: http://umcgresearchdatacatalogue.nl/CatalogueOntologies/api/rdf/Themes/name=Health
theme: HEAL
access rights: http://umcgresearchdatacatalogue.nl/CatalogueOntologies/api/rdf/AccessRights/name=Non%20public
access rights: NON PUBLIC
applicable legislation: http://umcgresearchdatacatalogue.nl/CatalogueOntologies/api/rdf/Legislations/name=Data%20Governance%20Act
applicable legislation: oj
mg_draft: false
mg_insertedOn: 2026-05-13T12:02:11
mg_updatedOn: 2026-05-13T12:02:11

LIFELINES_NEXT LIFELINES_NEXT M9
type: Collection events
type: Observation
endpoint URL: catalogue_rdf
data set: Collection events
source: LIFELINES_NEXT
resource: LIFELINES_NEXT
title: LIFELINES_NEXT M9
name: LIFELINES_NEXT M9
pid: https://umcgresearchdatacatalogue.nl/all/collections/LIFELINES_NEXT/collection-events/LIFELINES_NEXT%20M9
description: Data collection at infant's age of 9 months
source: LIFELINES_NEXT LIFELINES_NEXT Mothers
subpopulations: LIFELINES_NEXT LIFELINES_NEXT Mothers
source: LIFELINES_NEXT LIFELINES_NEXT Children
subpopulations: LIFELINES_NEXT LIFELINES_NEXT Children
keyword: Breast milk
keywords: Breast milk
keyword: Development
keywords: Development
keyword: Urine
keywords: Urine
keyword: Blood
keywords: Blood
keyword: Cord blood
keywords: Cord blood
keyword: Healthy ageing
keywords: Healthy ageing
keyword: Birth cohort
keywords: Birth cohort
keyword: Transgenerational effects
keywords: Transgenerational effects
keyword: Meconium
keywords: Meconium
keyword: Microbiome
keywords: Microbiome
keyword: Biobank
keywords: Biobank
keyword: Feces
keywords: Feces
start date: 2017-01-01
age groups: http://umcgresearchdatacatalogue.nl/CatalogueOntologies/api/rdf/AgeGroups/name=Young%20adult%20%2818-24%20years%29
age groups: http://umcgresearchdatacatalogue.nl/CatalogueOntologies/api/rdf/AgeGroups/name=Middle-aged%20%2845-64%20years%29
age groups: http://umcgresearchdatacatalogue.nl/CatalogueOntologies/api/rdf/AgeGroups/name=Adult%20%2825-44%20years%29
age groups: http://umcgresearchdatacatalogue.nl/CatalogueOntologies/api/rdf/AgeGroups/name=Infants%20and%20toddlers%20%282-23%20months%29
number of participants: 1450
areas of information: http://umcgresearchdatacatalogue.nl/CatalogueOntologies/api/rdf/AreasOfInformationCohorts/name=Life%20course%20development
areas of information: http://umcgresearchdatacatalogue.nl/CatalogueOntologies/api/rdf/AreasOfInformationCohorts/name=Microbiology
areas of information: http://umcgresearchdatacatalogue.nl/CatalogueOntologies/api/rdf/AreasOfInformationCohorts/name=Perception%20of%20health
areas of information: http://umcgresearchdatacatalogue.nl/CatalogueOntologies/api/rdf/AreasOfInformationCohorts/name=Psychological%20distress%20and%20emotions
areas of information: http://umcgresearchdatacatalogue.nl/CatalogueOntologies/api/rdf/AreasOfInformationCohorts/name=Questionnaire%20and%20interview-related%20information
areas of information: http://umcgresearchdatacatalogue.nl/CatalogueOntologies/api/rdf/AreasOfInformationCohorts/name=Genomics
areas of information: http://umcgresearchdatacatalogue.nl/CatalogueOntologies/api/rdf/AreasOfInformationCohorts/name=Breastfeeding
areas of information: http://umcgresearchdatacatalogue.nl/CatalogueOntologies/api/rdf/AreasOfInformationCohorts/name=Nutrition
areas of information: http://umcgresearchdatacatalogue.nl/CatalogueOntologies/api/rdf/AreasOfInformationCohorts/name=Medication%20and%20supplement%20intake
data categories: http://umcgresearchdatacatalogue.nl/CatalogueOntologies/api/rdf/DataCategories/name=Survey%20data
data categories: http://umcgresearchdatacatalogue.nl/CatalogueOntologies/api/rdf/DataCategories/name=Biological%20samples
sample categories: http://umcgresearchdatacatalogue.nl/CatalogueOntologies/api/rdf/SampleCategories/name=Milk%2C%20Human
sample categories: http://umcgresearchdatacatalogue.nl/CatalogueOntologies/api/rdf/SampleCategories/name=Feces
standardized tools: http://umcgresearchdatacatalogue.nl/CatalogueOntologies/api/rdf/StandardizedTools/name=Rome%20III%20IBS%20Diagnostic%20Questionnaire
standardized tools: http://umcgresearchdatacatalogue.nl/CatalogueOntologies/api/rdf/StandardizedTools/name=Infant%20Behavior%20Questionnaire
standardized tools: http://umcgresearchdatacatalogue.nl/CatalogueOntologies/api/rdf/StandardizedTools/name=Food%20Frequency%20Questionnaire
standardized tools: http://umcgresearchdatacatalogue.nl/CatalogueOntologies/api/rdf/StandardizedTools/name=Edinburgh%20Postnatal%20%28Postpartum%29%20Depression%20Scale
contact point: LIFELINES_NEXT Lifelines NEXT Contact
publisher: LIFELINES_NEXT UMCG
creator: LIFELINES_NEXT UMCG
theme: http://umcgresearchdatacatalogue.nl/CatalogueOntologies/api/rdf/Themes/name=Health
theme: HEAL
access rights: http://umcgresearchdatacatalogue.nl/CatalogueOntologies/api/rdf/AccessRights/name=Non%20public
access rights: NON PUBLIC
applicable legislation: http://umcgresearchdatacatalogue.nl/CatalogueOntologies/api/rdf/Legislations/name=Data%20Governance%20Act
applicable legislation: oj
mg_draft: false
mg_insertedOn: 2026-05-13T12:02:11
mg_updatedOn: 2026-05-13T12:02:11

LIFELINES_NEXT LIFELINES_NEXT P12
type: Collection events
type: Observation
endpoint URL: catalogue_rdf
data set: Collection events
source: LIFELINES_NEXT
resource: LIFELINES_NEXT
title: LIFELINES_NEXT P12
name: LIFELINES_NEXT P12
pid: https://umcgresearchdatacatalogue.nl/all/collections/LIFELINES_NEXT/collection-events/LIFELINES_NEXT%20P12
description: Data collection at gestational age of 12 weeks
source: LIFELINES_NEXT LIFELINES_NEXT Mothers
subpopulations: LIFELINES_NEXT LIFELINES_NEXT Mothers
keyword: Breast milk
keywords: Breast milk
keyword: Development
keywords: Development
keyword: Urine
keywords: Urine
keyword: Blood
keywords: Blood
keyword: Cord blood
keywords: Cord blood
keyword: Healthy ageing
keywords: Healthy ageing
keyword: Birth cohort
keywords: Birth cohort
keyword: Transgenerational effects
keywords: Transgenerational effects
keyword: Meconium
keywords: Meconium
keyword: Microbiome
keywords: Microbiome
keyword: Biobank
keywords: Biobank
keyword: Feces
keywords: Feces
start date: 2016-01-01
age groups: http://umcgresearchdatacatalogue.nl/CatalogueOntologies/api/rdf/AgeGroups/name=Young%20adult%20%2818-24%20years%29
age groups: http://umcgresearchdatacatalogue.nl/CatalogueOntologies/api/rdf/AgeGroups/name=Middle-aged%20%2845-64%20years%29
age groups: http://umcgresearchdatacatalogue.nl/CatalogueOntologies/api/rdf/AgeGroups/name=Adult%20%2825-44%20years%29
number of participants: 1450
areas of information: http://umcgresearchdatacatalogue.nl/CatalogueOntologies/api/rdf/AreasOfInformationCohorts/name=Microbiology
areas of information: http://umcgresearchdatacatalogue.nl/CatalogueOntologies/api/rdf/AreasOfInformationCohorts/name=Nutrition
areas of information: http://umcgresearchdatacatalogue.nl/CatalogueOntologies/api/rdf/AreasOfInformationCohorts/name=Virology
areas of information: http://umcgresearchdatacatalogue.nl/CatalogueOntologies/api/rdf/AreasOfInformationCohorts/name=Date%20and%20time-related%20information
areas of information: http://umcgresearchdatacatalogue.nl/CatalogueOntologies/api/rdf/AreasOfInformationCohorts/name=Immunology
areas of information: http://umcgresearchdatacatalogue.nl/CatalogueOntologies/api/rdf/AreasOfInformationCohorts/name=Work%20life
areas of information: http://umcgresearchdatacatalogue.nl/CatalogueOntologies/api/rdf/AreasOfInformationCohorts/name=Questionnaire%20and%20interview-related%20information
areas of information: http://umcgresearchdatacatalogue.nl/CatalogueOntologies/api/rdf/AreasOfInformationCohorts/name=Genomics
data categories: http://umcgresearchdatacatalogue.nl/CatalogueOntologies/api/rdf/DataCategories/name=Survey%20data
data categories: http://umcgresearchdatacatalogue.nl/CatalogueOntologies/api/rdf/DataCategories/name=Biological%20samples
data categories: http://umcgresearchdatacatalogue.nl/CatalogueOntologies/api/rdf/DataCategories/name=Genomics
data categories: http://umcgresearchdatacatalogue.nl/CatalogueOntologies/api/rdf/DataCategories/name=Metabolomics
data categories: http://umcgresearchdatacatalogue.nl/CatalogueOntologies/api/rdf/DataCategories/name=Proteomics
sample categories: http://umcgresearchdatacatalogue.nl/CatalogueOntologies/api/rdf/SampleCategories/name=DNA
sample categories: http://umcgresearchdatacatalogue.nl/CatalogueOntologies/api/rdf/SampleCategories/name=Plasma
sample categories: http://umcgresearchdatacatalogue.nl/CatalogueOntologies/api/rdf/SampleCategories/name=RNA
sample categories: http://umcgresearchdatacatalogue.nl/CatalogueOntologies/api/rdf/SampleCategories/name=Blood%20Buffy%20Coat
sample categories: http://umcgresearchdatacatalogue.nl/CatalogueOntologies/api/rdf/SampleCategories/name=Feces
sample categories: http://umcgresearchdatacatalogue.nl/CatalogueOntologies/api/rdf/SampleCategories/name=Blood%20%28whole%29
sample categories: http://umcgresearchdatacatalogue.nl/CatalogueOntologies/api/rdf/SampleCategories/name=Serum
standardized tools: http://umcgresearchdatacatalogue.nl/CatalogueOntologies/api/rdf/StandardizedTools/name=Survey%C2%A0Work-home%C2%A0Interaction%E2%80%94NijmeGen
contact point: LIFELINES_NEXT Lifelines NEXT Contact
publisher: LIFELINES_NEXT UMCG
creator: LIFELINES_NEXT UMCG
theme: http://umcgresearchdatacatalogue.nl/CatalogueOntologies/api/rdf/Themes/name=Health
theme: HEAL
access rights: http://umcgresearchdatacatalogue.nl/CatalogueOntologies/api/rdf/AccessRights/name=Non%20public
access rights: NON PUBLIC
applicable legislation: http://umcgresearchdatacatalogue.nl/CatalogueOntologies/api/rdf/Legislations/name=Data%20Governance%20Act
applicable legislation: oj
mg_draft: false
mg_insertedOn: 2026-05-13T12:02:11
mg_updatedOn: 2026-05-13T12:02:11

LIFELINES_NEXT LIFELINES_NEXT M4
type: Collection events
type: Observation
endpoint URL: catalogue_rdf
data set: Collection events
source: LIFELINES_NEXT
resource: LIFELINES_NEXT
title: LIFELINES_NEXT M4
name: LIFELINES_NEXT M4
pid: https://umcgresearchdatacatalogue.nl/all/collections/LIFELINES_NEXT/collection-events/LIFELINES_NEXT%20M4
description: Data collection at infant's age of 4 months
source: LIFELINES_NEXT LIFELINES_NEXT Mothers
subpopulations: LIFELINES_NEXT LIFELINES_NEXT Mothers
source: LIFELINES_NEXT LIFELINES_NEXT Children
subpopulations: LIFELINES_NEXT LIFELINES_NEXT Children
keyword: Breast milk
keywords: Breast milk
keyword: Development
keywords: Development
keyword: Urine
keywords: Urine
keyword: Blood
keywords: Blood
keyword: Cord blood
keywords: Cord blood
keyword: Healthy ageing
keywords: Healthy ageing
keyword: Birth cohort
keywords: Birth cohort
keyword: Transgenerational effects
keywords: Transgenerational effects
keyword: Meconium
keywords: Meconium
keyword: Microbiome
keywords: Microbiome
keyword: Biobank
keywords: Biobank
keyword: Feces
keywords: Feces
start date: 2017-01-01
age groups: http://umcgresearchdatacatalogue.nl/CatalogueOntologies/api/rdf/AgeGroups/name=Young%20adult%20%2818-24%20years%29
age groups: http://umcgresearchdatacatalogue.nl/CatalogueOntologies/api/rdf/AgeGroups/name=Middle-aged%20%2845-64%20years%29
age groups: http://umcgresearchdatacatalogue.nl/CatalogueOntologies/api/rdf/AgeGroups/name=Adult%20%2825-44%20years%29
age groups: http://umcgresearchdatacatalogue.nl/CatalogueOntologies/api/rdf/AgeGroups/name=Infants%20and%20toddlers%20%282-23%20months%29
number of participants: 1450
areas of information: http://umcgresearchdatacatalogue.nl/CatalogueOntologies/api/rdf/AreasOfInformationCohorts/name=Questionnaire%20and%20interview-related%20information
areas of information: http://umcgresearchdatacatalogue.nl/CatalogueOntologies/api/rdf/AreasOfInformationCohorts/name=Perception%20of%20health
areas of information: http://umcgresearchdatacatalogue.nl/CatalogueOntologies/api/rdf/AreasOfInformationCohorts/name=Sleep
areas of information: http://umcgresearchdatacatalogue.nl/CatalogueOntologies/api/rdf/AreasOfInformationCohorts/name=Parenting%20and%20familial%20environment
data categories: http://umcgresearchdatacatalogue.nl/CatalogueOntologies/api/rdf/DataCategories/name=Survey%20data
standardized tools: http://umcgresearchdatacatalogue.nl/CatalogueOntologies/api/rdf/StandardizedTools/name=Brief%20Infant%20Sleep%20Questionnaire
standardized tools: http://umcgresearchdatacatalogue.nl/CatalogueOntologies/api/rdf/StandardizedTools/name=Self-Efficacy%20for%20Parenting%20Task%20Index%20-%20Toddler%20Scale
standardized tools: http://umcgresearchdatacatalogue.nl/CatalogueOntologies/api/rdf/StandardizedTools/name=Infant%20Behavior%20Questionnaire
standardized tools other: Preventie en Incidentie van Astma en Mijt Allergie (PIAMA)
contact point: LIFELINES_NEXT Lifelines NEXT Contact
publisher: LIFELINES_NEXT UMCG
creator: LIFELINES_NEXT UMCG
theme: http://umcgresearchdatacatalogue.nl/CatalogueOntologies/api/rdf/Themes/name=Health
theme: HEAL
access rights: http://umcgresearchdatacatalogue.nl/CatalogueOntologies/api/rdf/AccessRights/name=Non%20public
access rights: NON PUBLIC
applicable legislation: http://umcgresearchdatacatalogue.nl/CatalogueOntologies/api/rdf/Legislations/name=Data%20Governance%20Act
applicable legislation: oj
mg_draft: false
mg_insertedOn: 2026-05-13T12:02:11
mg_updatedOn: 2026-05-13T12:02:11

EGAS00001006657 EGAS00001006657 ORIENT study
type: Collection events
type: Observation
endpoint URL: catalogue_rdf
data set: Collection events
source: EGAS00001006657
resource: EGAS00001006657
title: EGAS00001006657 ORIENT study
name: EGAS00001006657 ORIENT study
pid: https://ega-archive.org/datasets/EGAD00001009687
description: scRNAseq dataset containing 5 healthy donors and 4 asthmatic donors.
keyword: single cell RNAseq
keywords: single cell RNAseq
keyword: asthma
keywords: asthma
number of participants: 8
data categories: http://umcgresearchdatacatalogue.nl/CatalogueOntologies/api/rdf/DataCategories/name=Genomics
standardized tools other: Illumina NovaSeq 6000
publisher: EGAS00001006657 UMCG
creator: EGAS00001006657 UMCG
theme: http://umcgresearchdatacatalogue.nl/CatalogueOntologies/api/rdf/Themes/name=Health
theme: HEAL
access rights: http://umcgresearchdatacatalogue.nl/CatalogueOntologies/api/rdf/AccessRights/name=Non%20public
access rights: NON PUBLIC
applicable legislation: http://umcgresearchdatacatalogue.nl/CatalogueOntologies/api/rdf/Legislations/name=Data%20Governance%20Act
applicable legislation: oj
mg_draft: false
mg_insertedOn: 2026-05-13T12:02:11
mg_updatedOn: 2026-05-13T12:02:11

EGAS00001005027 EGAS00001005027 The Dutch Microbiome Project Batch 2
type: Collection events
type: Observation
endpoint URL: catalogue_rdf
data set: Collection events
source: EGAS00001005027
resource: EGAS00001005027
title: EGAS00001005027 The Dutch Microbiome Project Batch 2
name: EGAS00001005027 The Dutch Microbiome Project Batch 2
pid: https://ega-archive.org/datasets/EGAD00001007501
description: The Dutch Microbiome Project (DMP) data includes shotgun metagenomic sequencing of faecal samples 8,208 Dutch individuals. Paired-end sequencing was performed using Illumina HiSeq 2000 platform. Data is archived in two batches to facilitate easier data access and upload to EGA. Batch 2 of DMP includes ~400 samples.
keyword: shotgun metagenomic sequencing
keywords: shotgun metagenomic sequencing
keyword: microbiome
keywords: microbiome
number of participants: 3848
data categories: http://umcgresearchdatacatalogue.nl/CatalogueOntologies/api/rdf/DataCategories/name=Genomics
standardized tools other: Illumina HiSeq 2000
contact point: EGAS00001005027 Lifelines Data Management
publisher: EGAS00001005027 UMCG
creator: EGAS00001005027 UMCG
theme: http://umcgresearchdatacatalogue.nl/CatalogueOntologies/api/rdf/Themes/name=Health
theme: HEAL
access rights: http://umcgresearchdatacatalogue.nl/CatalogueOntologies/api/rdf/AccessRights/name=Non%20public
access rights: NON PUBLIC
applicable legislation: http://umcgresearchdatacatalogue.nl/CatalogueOntologies/api/rdf/Legislations/name=Data%20Governance%20Act
applicable legislation: oj
mg_draft: false
mg_insertedOn: 2026-05-13T12:02:11
mg_updatedOn: 2026-05-13T12:02:11

EGAS00001005189 EGAS00001005189 PIAMA DNA methylation dataset
type: Collection events
type: Observation
endpoint URL: catalogue_rdf
data set: Collection events
source: EGAS00001005189
resource: EGAS00001005189
title: EGAS00001005189 PIAMA DNA methylation dataset
name: EGAS00001005189 PIAMA DNA methylation dataset
pid: https://ega-archive.org/datasets/EGAD00010002263
description: Nasal DNA methylation at three CpG sites predicts childhood allergic disease
keyword: childhood allergic disease
keywords: childhood allergic disease
keyword: nasal DNA methylation
keywords: nasal DNA methylation
number of participants: 696
data categories: http://umcgresearchdatacatalogue.nl/CatalogueOntologies/api/rdf/DataCategories/name=Genomics
standardized tools other: Illumina 450K
publisher: EGAS00001005189 UMCG
creator: EGAS00001005189 UMCG
theme: http://umcgresearchdatacatalogue.nl/CatalogueOntologies/api/rdf/Themes/name=Health
theme: HEAL
access rights: http://umcgresearchdatacatalogue.nl/CatalogueOntologies/api/rdf/AccessRights/name=Non%20public
access rights: NON PUBLIC
applicable legislation: http://umcgresearchdatacatalogue.nl/CatalogueOntologies/api/rdf/Legislations/name=Data%20Governance%20Act
applicable legislation: oj
mg_draft: false
mg_insertedOn: 2026-05-13T12:02:11
mg_updatedOn: 2026-05-13T12:02:11

EGAS00001005225 EGAS00001005225 GFD viral enrichment sequencing
type: Collection events
type: Observation
endpoint URL: catalogue_rdf
data set: Collection events
source: EGAS00001005225
resource: EGAS00001005225
title: EGAS00001005225 GFD viral enrichment sequencing
name: EGAS00001005225 GFD viral enrichment sequencing
pid: https://ega-archive.org/datasets/EGAD00001007638
description: sequencing of libraires enriched for viral particles
keyword: sequencing library
keywords: sequencing library
keyword: GFD viral enrichment
keywords: GFD viral enrichment
number of participants: 33
data categories: http://umcgresearchdatacatalogue.nl/CatalogueOntologies/api/rdf/DataCategories/name=Genomics
standardized tools other: NextSeq 550
publisher: EGAS00001005225 UMCG
creator: EGAS00001005225 UMCG
theme: http://umcgresearchdatacatalogue.nl/CatalogueOntologies/api/rdf/Themes/name=Health
theme: HEAL
access rights: http://umcgresearchdatacatalogue.nl/CatalogueOntologies/api/rdf/AccessRights/name=Non%20public
access rights: NON PUBLIC
applicable legislation: http://umcgresearchdatacatalogue.nl/CatalogueOntologies/api/rdf/Legislations/name=Data%20Governance%20Act
applicable legislation: oj
mg_draft: false
mg_insertedOn: 2026-05-13T12:02:11
mg_updatedOn: 2026-05-13T12:02:11

EGAS00001005225 EGAS00001005225 GFD metagenomic sequencing
type: Collection events
type: Observation
endpoint URL: catalogue_rdf
data set: Collection events
source: EGAS00001005225
resource: EGAS00001005225
title: EGAS00001005225 GFD metagenomic sequencing
name: EGAS00001005225 GFD metagenomic sequencing
pid: https://ega-archive.org/datasets/EGAD00001007639
description: Sequencing of fecal metagenomic libraries
keyword: fecal metagenomic libraries
keywords: fecal metagenomic libraries
number of participants: 33
data categories: http://umcgresearchdatacatalogue.nl/CatalogueOntologies/api/rdf/DataCategories/name=Genomics
standardized tools other: Illumina HiSeq 2000
publisher: EGAS00001005225 UMCG
creator: EGAS00001005225 UMCG
theme: http://umcgresearchdatacatalogue.nl/CatalogueOntologies/api/rdf/Themes/name=Health
theme: HEAL
access rights: http://umcgresearchdatacatalogue.nl/CatalogueOntologies/api/rdf/AccessRights/name=Non%20public
access rights: NON PUBLIC
applicable legislation: http://umcgresearchdatacatalogue.nl/CatalogueOntologies/api/rdf/Legislations/name=Data%20Governance%20Act
applicable legislation: oj
mg_draft: false
mg_insertedOn: 2026-05-13T12:02:11
mg_updatedOn: 2026-05-13T12:02:11

EGAS00001005376 EGAS00001005376 1M-scBloodNL
type: Collection events
type: Observation
endpoint URL: catalogue_rdf
data set: Collection events
source: EGAS00001005376
resource: EGAS00001005376
title: EGAS00001005376 1M-scBloodNL
name: EGAS00001005376 1M-scBloodNL
pid: https://ega-archive.org/datasets/EGAD00001007764
description: Here we present the 1M-scBloodNL study, in which we performed single-cell RNA-seq on 120 individuals of the Northern Netherlands population cohort Lifelines. For each individual peripheral blood mononuclear cells (PBMCs) were sequenced in an unstimulated condition, and after 3 and 24 hour in vitro stimulation with C. albicans (CA), M. tuberculosis (MTB) and P. aeruginosa (PA), totalling approximately 1.3 million cells. scRNA-seq was conducted with the 10X Genomics 3'-end v2 (72 libraries) and v3 (33 libraries) technology. In general, each library contains PBMCs from 8 donors and 2 different stimulation-timepoint combinations. Donors were demultiplexed using a combination of SoupOrCell (https://www.nature.com/articles/s41592-020-0820-1) and genotype information to assign the correct donor to a donor-specific cell cluster.
keyword: eQTL
keywords: eQTL
keyword: Lifelines
keywords: Lifelines
keyword: PMBCs
keywords: PMBCs
number of participants: 988
data categories: http://umcgresearchdatacatalogue.nl/CatalogueOntologies/api/rdf/DataCategories/name=Genomics
standardized tools other: Illumina NovaSeq 6000
contact point: EGAS00001005376 Monique van der Wijst
publisher: EGAS00001005376 UMCG
creator: EGAS00001005376 UMCG
theme: http://umcgresearchdatacatalogue.nl/CatalogueOntologies/api/rdf/Themes/name=Health
theme: HEAL
access rights: http://umcgresearchdatacatalogue.nl/CatalogueOntologies/api/rdf/AccessRights/name=Non%20public
access rights: NON PUBLIC
applicable legislation: http://umcgresearchdatacatalogue.nl/CatalogueOntologies/api/rdf/Legislations/name=Data%20Governance%20Act
applicable legislation: oj
mg_draft: false
mg_insertedOn: 2026-05-13T12:02:11
mg_updatedOn: 2026-05-13T12:02:11

EGAS00001006258 EGAS00001006258 TransplantLines Gut Microbiome study
type: Collection events
type: Observation
endpoint URL: catalogue_rdf
data set: Collection events
source: EGAS00001006258
resource: EGAS00001006258
title: EGAS00001006258 TransplantLines Gut Microbiome study
name: EGAS00001006258 TransplantLines Gut Microbiome study
pid: https://ega-archive.org/datasets/EGAD00001008907
description: The TransplantLines Gut Microbiome study includes raw data generated by shotgun metagenomic sequencing of fecal samples of solid organ transplant recipients and basic phenotypes (age and sex, BMI).
keyword: gut microbiome
keywords: gut microbiome
keyword: solid organ transplant recipients
keywords: solid organ transplant recipients
keyword: metagenomic sequencing
keywords: metagenomic sequencing
number of participants: 1177
data categories: http://umcgresearchdatacatalogue.nl/CatalogueOntologies/api/rdf/DataCategories/name=Genomics
standardized tools other: Illumina HiSeq 2000
publisher: EGAS00001006258 UMCG
creator: EGAS00001006258 UMCG
theme: http://umcgresearchdatacatalogue.nl/CatalogueOntologies/api/rdf/Themes/name=Health
theme: HEAL
access rights: http://umcgresearchdatacatalogue.nl/CatalogueOntologies/api/rdf/AccessRights/name=Non%20public
access rights: NON PUBLIC
applicable legislation: http://umcgresearchdatacatalogue.nl/CatalogueOntologies/api/rdf/Legislations/name=Data%20Governance%20Act
applicable legislation: oj
mg_draft: false
mg_insertedOn: 2026-05-13T12:02:11
mg_updatedOn: 2026-05-13T12:02:11

EGAS00001006347 EGAS00001006347 High hyperdiploid ALL single cell whole genome sequencing
type: Collection events
type: Observation
endpoint URL: catalogue_rdf
data set: Collection events
source: EGAS00001006347
resource: EGAS00001006347
title: EGAS00001006347 High hyperdiploid ALL single cell whole genome sequencing
name: EGAS00001006347 High hyperdiploid ALL single cell whole genome sequencing
pid: https://ega-archive.org/datasets/EGAD00001008988
description: This dataset was collected from viable bone marrow cells obtained at diagnosis from nine patients with high hyperdiploid ALL and one normal bone marrow sample. All samples were subjected to low pass single cell whole genome sequencing with the median sequencing coverage of 0.02x. Single nuclei in G0/G1 phase were isolated using a fluorescence-activated cell sorting (FACS) cytometer. DNA libraries were constructed and associated next-generation sequencing was carried out by European Research Institute for the Biology of Ageing (ERIBA), University of Groningen, University Medical Center Groningen, Groningen, The Netherlands. Further details regarding the DNA libraries construction are available by Bos et. al., 2019 (https://link.springer.com/protocol/10.1007/978-1-4939-8931-7_15).
keyword: bone marrow cells
keywords: bone marrow cells
keyword: high hyperdiploid ALL
keywords: high hyperdiploid ALL
keyword: FACS
keywords: FACS
number of participants: 2842
data categories: http://umcgresearchdatacatalogue.nl/CatalogueOntologies/api/rdf/DataCategories/name=Genomics
standardized tools other: NextSeq 550
publisher: EGAS00001006347 UMCG
creator: EGAS00001006347 UMCG
theme: http://umcgresearchdatacatalogue.nl/CatalogueOntologies/api/rdf/Themes/name=Health
theme: HEAL
access rights: http://umcgresearchdatacatalogue.nl/CatalogueOntologies/api/rdf/AccessRights/name=Non%20public
access rights: NON PUBLIC
applicable legislation: http://umcgresearchdatacatalogue.nl/CatalogueOntologies/api/rdf/Legislations/name=Data%20Governance%20Act
applicable legislation: oj
mg_draft: false
mg_insertedOn: 2026-05-13T12:02:11
mg_updatedOn: 2026-05-13T12:02:11

EGAS00001007021 EGAS00001007021 Single-cell dissection of the immune response after a myocardial infarction
type: Collection events
type: Observation
endpoint URL: catalogue_rdf
data set: Collection events
source: EGAS00001007021
resource: EGAS00001007021
title: EGAS00001007021 Single-cell dissection of the immune response after a myocardial infarction
name: EGAS00001007021 Single-cell dissection of the immune response after a myocardial infarction
pid: https://ega-archive.org/datasets/EGAD00001010064
description: 38 STEMI patients at hospital admission, 24 hours (acute phase) and 6-8 weeks (chronic phase) after STEMI
keyword: STEMI
keywords: STEMI
number of participants: 9
data categories: http://umcgresearchdatacatalogue.nl/CatalogueOntologies/api/rdf/DataCategories/name=Genomics
standardized tools other: unspecified
contact point: EGAS00001007021 Monique van der Wijst
publisher: EGAS00001007021 UMCG
creator: EGAS00001007021 UMCG
theme: http://umcgresearchdatacatalogue.nl/CatalogueOntologies/api/rdf/Themes/name=Health
theme: HEAL
access rights: http://umcgresearchdatacatalogue.nl/CatalogueOntologies/api/rdf/AccessRights/name=Non%20public
access rights: NON PUBLIC
applicable legislation: http://umcgresearchdatacatalogue.nl/CatalogueOntologies/api/rdf/Legislations/name=Data%20Governance%20Act
applicable legislation: oj
mg_draft: false
mg_insertedOn: 2026-05-13T12:02:11
mg_updatedOn: 2026-05-13T12:02:11

EGAS00001007054 EGAS00001007054 PhIP-Seq Serum 1000IBD
type: Collection events
type: Observation
endpoint URL: catalogue_rdf
data set: Collection events
source: EGAS00001007054
resource: EGAS00001007054
title: EGAS00001007054 PhIP-Seq Serum 1000IBD
name: EGAS00001007054 PhIP-Seq Serum 1000IBD
pid: https://ega-archive.org/datasets/EGAD00001010118
description: PhIP-Seq experiment conducted in Eran Sigal's group at WIS.
keyword: IBD
keywords: IBD
keyword: PhIP-Seq
keywords: PhIP-Seq
keyword: Crohn's disease
keywords: Crohn's disease
keyword: ulcerative collitis
keywords: ulcerative collitis
number of participants: 497
data categories: http://umcgresearchdatacatalogue.nl/CatalogueOntologies/api/rdf/DataCategories/name=Genomics
standardized tools other: NextSeq 500
publisher: EGAS00001007054 UMCG
creator: EGAS00001007054 UMCG
theme: http://umcgresearchdatacatalogue.nl/CatalogueOntologies/api/rdf/Themes/name=Health
theme: HEAL
access rights: http://umcgresearchdatacatalogue.nl/CatalogueOntologies/api/rdf/AccessRights/name=Non%20public
access rights: NON PUBLIC
applicable legislation: http://umcgresearchdatacatalogue.nl/CatalogueOntologies/api/rdf/Legislations/name=Data%20Governance%20Act
applicable legislation: oj
mg_draft: false
mg_insertedOn: 2026-05-13T12:02:11
mg_updatedOn: 2026-05-13T12:02:11

EGAS00001007450 EGAS00001007450 scRNAseq data from ALI cultures of healthy donors and patients with asthma, infected with RSV
type: Collection events
type: Observation
endpoint URL: catalogue_rdf
data set: Collection events
source: EGAS00001007450
resource: EGAS00001007450
title: EGAS00001007450 scRNAseq data from ALI cultures of healthy donors and patients with asthma, infected with RSV
name: EGAS00001007450 scRNAseq data from ALI cultures of healthy donors and patients with asthma, infected with RSV
pid: https://ega-archive.org/datasets/EGAD00001011264
description: This dataset contains the count matrices and corresponding metadata for our study on bronchial epithelial cells response to RSV in healthy and in asthma. This scRNAseq data is from primary cells, that have been differentiated in ALI cultures and infected with RSV.
keyword: bronchial epithelial cells
keywords: bronchial epithelial cells
keyword: scRNAseq
keywords: scRNAseq
keyword: asthma
keywords: asthma
keyword: RSV
keywords: RSV
number of participants: 8
data categories: http://umcgresearchdatacatalogue.nl/CatalogueOntologies/api/rdf/DataCategories/name=Genomics
standardized tools other: Illumina NovaSeq 6000
publisher: EGAS00001007450 UMCG
creator: EGAS00001007450 UMCG
theme: http://umcgresearchdatacatalogue.nl/CatalogueOntologies/api/rdf/Themes/name=Health
theme: HEAL
access rights: http://umcgresearchdatacatalogue.nl/CatalogueOntologies/api/rdf/AccessRights/name=Non%20public
access rights: NON PUBLIC
applicable legislation: http://umcgresearchdatacatalogue.nl/CatalogueOntologies/api/rdf/Legislations/name=Data%20Governance%20Act
applicable legislation: oj
mg_draft: false
mg_insertedOn: 2026-05-13T12:02:11
mg_updatedOn: 2026-05-13T12:02:11

EGAS00001007571 EGAS00001007571 CS Baby Biome gut microbiome
type: Collection events
type: Observation
endpoint URL: catalogue_rdf
data set: Collection events
source: EGAS00001007571
resource: EGAS00001007571
title: EGAS00001007571 CS Baby Biome gut microbiome
name: EGAS00001007571 CS Baby Biome gut microbiome
pid: https://ega-archive.org/datasets/EGAD00001011264
description: This dataset contains metagenomic sequencing of stool samples of babies from CS Baby Biome project, and their mothers
keyword: intrapartum antibiotics
keywords: intrapartum antibiotics
keyword: baby gut microbiome
keywords: baby gut microbiome
number of participants: 195
data categories: http://umcgresearchdatacatalogue.nl/CatalogueOntologies/api/rdf/DataCategories/name=Genomics
standardized tools other: Illumina HiSeq 2000
publisher: EGAS00001007571 UMCG
creator: EGAS00001007571 UMCG
theme: http://umcgresearchdatacatalogue.nl/CatalogueOntologies/api/rdf/Themes/name=Health
theme: HEAL
access rights: http://umcgresearchdatacatalogue.nl/CatalogueOntologies/api/rdf/AccessRights/name=Non%20public
access rights: NON PUBLIC
applicable legislation: http://umcgresearchdatacatalogue.nl/CatalogueOntologies/api/rdf/Legislations/name=Data%20Governance%20Act
applicable legislation: oj
mg_draft: false
mg_insertedOn: 2026-05-13T12:02:11
mg_updatedOn: 2026-05-13T12:02:11

EGAS50000000133 EGAS50000000133 Lifelines NEXT 16S v3-v4 amplicon sequencing
type: Collection events
type: Observation
endpoint URL: catalogue_rdf
data set: Collection events
source: EGAS50000000133
resource: EGAS50000000133
title: EGAS50000000133 Lifelines NEXT 16S v3-v4 amplicon sequencing
name: EGAS50000000133 Lifelines NEXT 16S v3-v4 amplicon sequencing
pid: https://ega-archive.org/datasets/EGAD50000000180
description: 16S v3-v4 amplicon sequencing of milk, fecal and oral cavity samples, along with sequencing controls, of a subset of newborn infants from Lifelines NEXT cohort
keyword: 16S v3-v4 amplicon sequencing
keywords: 16S v3-v4 amplicon sequencing
keyword: Lifelines NEXT
keywords: Lifelines NEXT
keyword: milk
keywords: milk
keyword: feces
keywords: feces
keyword: oral cavity samples
keywords: oral cavity samples
number of participants: 98
data categories: http://umcgresearchdatacatalogue.nl/CatalogueOntologies/api/rdf/DataCategories/name=Genomics
standardized tools other: Illumina MiSeq
publisher: EGAS50000000133 UMCG
creator: EGAS50000000133 UMCG
theme: http://umcgresearchdatacatalogue.nl/CatalogueOntologies/api/rdf/Themes/name=Health
theme: HEAL
access rights: http://umcgresearchdatacatalogue.nl/CatalogueOntologies/api/rdf/AccessRights/name=Non%20public
access rights: NON PUBLIC
applicable legislation: http://umcgresearchdatacatalogue.nl/CatalogueOntologies/api/rdf/Legislations/name=Data%20Governance%20Act
applicable legislation: oj
mg_draft: false
mg_insertedOn: 2026-05-13T12:02:11
mg_updatedOn: 2026-05-13T12:02:11

EGAS50000000133 EGAS50000000133 Lifelines NEXT 16S-ITS-23S long read sequencing
type: Collection events
type: Observation
endpoint URL: catalogue_rdf
data set: Collection events
source: EGAS50000000133
resource: EGAS50000000133
title: EGAS50000000133 Lifelines NEXT 16S-ITS-23S long read sequencing
name: EGAS50000000133 Lifelines NEXT 16S-ITS-23S long read sequencing
pid: https://ega-archive.org/datasets/EGAD50000000181
description: 16S-ITS-23S amplicon long read PacBio sequencing of milk, fecal and oral cavity samples, along with sequencing controls, of a subset of newborn infants from Lifelines NEXT cohort
keyword: newborn
keywords: newborn
keyword: feces
keywords: feces
keyword: milk
keywords: milk
keyword: 16S-ITS-23S amplicon long read PacBio sequencing
keywords: 16S-ITS-23S amplicon long read PacBio sequencing
keyword: oral cavity samples
keywords: oral cavity samples
keyword: Lifelines NEXT
keywords: Lifelines NEXT
number of participants: 66
data categories: http://umcgresearchdatacatalogue.nl/CatalogueOntologies/api/rdf/DataCategories/name=Genomics
standardized tools other: Sequel II
publisher: EGAS50000000133 UMCG
creator: EGAS50000000133 UMCG
theme: http://umcgresearchdatacatalogue.nl/CatalogueOntologies/api/rdf/Themes/name=Health
theme: HEAL
access rights: http://umcgresearchdatacatalogue.nl/CatalogueOntologies/api/rdf/AccessRights/name=Non%20public
access rights: NON PUBLIC
applicable legislation: http://umcgresearchdatacatalogue.nl/CatalogueOntologies/api/rdf/Legislations/name=Data%20Governance%20Act
applicable legislation: oj
mg_draft: false
mg_insertedOn: 2026-05-13T12:02:11
mg_updatedOn: 2026-05-13T12:02:11

EGAS50000000133 EGAS50000000133 HMO-microbiome study dataset, 16S sequencing
type: Collection events
type: Observation
endpoint URL: catalogue_rdf
data set: Collection events
source: EGAS50000000133
resource: EGAS50000000133
title: EGAS50000000133 HMO-microbiome study dataset, 16S sequencing
name: EGAS50000000133 HMO-microbiome study dataset, 16S sequencing
pid: https://ega-archive.org/datasets/EGAD50000000531
description: This dataset contains 16S sequencing of fecal and milk samples for HMO-microbiome Lifelines NEXT study
keyword: milk
keywords: milk
keyword: feces
keywords: feces
keyword: 16S sequencing
keywords: 16S sequencing
keyword: Lifelines NEXT
keywords: Lifelines NEXT
number of participants: 1501
data categories: http://umcgresearchdatacatalogue.nl/CatalogueOntologies/api/rdf/DataCategories/name=Genomics
standardized tools other: Illumina MiSeq
publisher: EGAS50000000133 UMCG
creator: EGAS50000000133 UMCG
theme: http://umcgresearchdatacatalogue.nl/CatalogueOntologies/api/rdf/Themes/name=Health
theme: HEAL
access rights: http://umcgresearchdatacatalogue.nl/CatalogueOntologies/api/rdf/AccessRights/name=Non%20public
access rights: NON PUBLIC
applicable legislation: http://umcgresearchdatacatalogue.nl/CatalogueOntologies/api/rdf/Legislations/name=Data%20Governance%20Act
applicable legislation: oj
mg_draft: false
mg_insertedOn: 2026-05-13T12:02:11
mg_updatedOn: 2026-05-13T12:02:11

EGAS50000000133 EGAS50000000133 Lifelines NEXT HMO Data
type: Collection events
type: Observation
endpoint URL: catalogue_rdf
data set: Collection events
source: EGAS50000000133
resource: EGAS50000000133
title: EGAS50000000133 Lifelines NEXT HMO Data
name: EGAS50000000133 Lifelines NEXT HMO Data
pid: https://ega-archive.org/datasets/EGAD50000000531
description: The dataset contains HMO measurements for 1542 samples from Lifelines NEXT cohort
keyword: Lifelines NEXT
keywords: Lifelines NEXT
keyword: HMO measurements
keywords: HMO measurements
number of participants: 1542
data categories: http://umcgresearchdatacatalogue.nl/CatalogueOntologies/api/rdf/DataCategories/name=Genomics
standardized tools other: Illumina MiSeq
publisher: EGAS50000000133 UMCG
creator: EGAS50000000133 UMCG
theme: http://umcgresearchdatacatalogue.nl/CatalogueOntologies/api/rdf/Themes/name=Health
theme: HEAL
access rights: http://umcgresearchdatacatalogue.nl/CatalogueOntologies/api/rdf/AccessRights/name=Non%20public
access rights: NON PUBLIC
applicable legislation: http://umcgresearchdatacatalogue.nl/CatalogueOntologies/api/rdf/Legislations/name=Data%20Governance%20Act
applicable legislation: oj
mg_draft: false
mg_insertedOn: 2026-05-13T12:02:11
mg_updatedOn: 2026-05-13T12:02:11

EGAS50000000483 EGAS50000000483 Patient TSO500 VCF files
type: Collection events
type: Observation
endpoint URL: catalogue_rdf
data set: Collection events
source: EGAS50000000483
resource: EGAS50000000483
title: EGAS50000000483 Patient TSO500 VCF files
name: EGAS50000000483 Patient TSO500 VCF files
pid: https://ega-archive.org/datasets/EGAD50000000694
description: Tumours from MMRd EC patients treated with 2 cycles neoadjuvant ICI. TruSight Oncology 500 (TSO 500) panel for all 10 tumour samples from patients included in the trial.
keyword: TSO 500 panel
keywords: TSO 500 panel
keyword: MMRd EC
keywords: MMRd EC
number of participants: 10
data categories: http://umcgresearchdatacatalogue.nl/CatalogueOntologies/api/rdf/DataCategories/name=Genomics
standardized tools other: Illumina NovaSeq 6000
contact point: EGAS50000000483 Marco de Bruyn
publisher: EGAS50000000483 UMCG
creator: EGAS50000000483 UMCG
theme: http://umcgresearchdatacatalogue.nl/CatalogueOntologies/api/rdf/Themes/name=Health
theme: HEAL
access rights: http://umcgresearchdatacatalogue.nl/CatalogueOntologies/api/rdf/AccessRights/name=Non%20public
access rights: NON PUBLIC
applicable legislation: http://umcgresearchdatacatalogue.nl/CatalogueOntologies/api/rdf/Legislations/name=Data%20Governance%20Act
applicable legislation: oj
mg_draft: false
mg_insertedOn: 2026-05-13T12:02:11
mg_updatedOn: 2026-05-13T12:02:11

LIFELINES_NEXT LIFELINES_NEXT Y3.5
type: Collection events
type: Observation
endpoint URL: catalogue_rdf
data set: Collection events
source: LIFELINES_NEXT
resource: LIFELINES_NEXT
title: LIFELINES_NEXT Y3.5
name: LIFELINES_NEXT Y3.5
pid: https://umcgresearchdatacatalogue.nl/all/collections/LIFELINES_NEXT/collection-events/LIFELINES_NEXT%20Y3.5
description: Data collection at infant's age of 3.5 years
source: LIFELINES_NEXT LIFELINES_NEXT Children
subpopulations: LIFELINES_NEXT LIFELINES_NEXT Children
keyword: Breast milk
keywords: Breast milk
keyword: Development
keywords: Development
keyword: Urine
keywords: Urine
keyword: Blood
keywords: Blood
keyword: Cord blood
keywords: Cord blood
keyword: Healthy ageing
keywords: Healthy ageing
keyword: Birth cohort
keywords: Birth cohort
keyword: Transgenerational effects
keywords: Transgenerational effects
keyword: Meconium
keywords: Meconium
keyword: Microbiome
keywords: Microbiome
keyword: Biobank
keywords: Biobank
keyword: Feces
keywords: Feces
start date: 2022-01-01
age groups: http://umcgresearchdatacatalogue.nl/CatalogueOntologies/api/rdf/AgeGroups/name=Child%20%282-12%20years%29
number of participants: 1380
areas of information: http://umcgresearchdatacatalogue.nl/CatalogueOntologies/api/rdf/AreasOfInformationCohorts/name=Questionnaire%20and%20interview-related%20information
areas of information: http://umcgresearchdatacatalogue.nl/CatalogueOntologies/api/rdf/AreasOfInformationCohorts/name=Life%20course%20development
data categories: http://umcgresearchdatacatalogue.nl/CatalogueOntologies/api/rdf/DataCategories/name=Survey%20data
standardized tools: http://umcgresearchdatacatalogue.nl/CatalogueOntologies/api/rdf/StandardizedTools/name=Ages%20and%20Stages%20Questionnaire
contact point: LIFELINES_NEXT Lifelines NEXT Contact
publisher: LIFELINES_NEXT UMCG
creator: LIFELINES_NEXT UMCG
theme: http://umcgresearchdatacatalogue.nl/CatalogueOntologies/api/rdf/Themes/name=Health
theme: HEAL
access rights: http://umcgresearchdatacatalogue.nl/CatalogueOntologies/api/rdf/AccessRights/name=Non%20public
access rights: NON PUBLIC
applicable legislation: http://umcgresearchdatacatalogue.nl/CatalogueOntologies/api/rdf/Legislations/name=Data%20Governance%20Act
applicable legislation: oj
mg_draft: false
mg_insertedOn: 2026-05-13T12:02:11
mg_updatedOn: 2026-05-13T12:02:11

LIFELINES_NEXT LIFELINES_NEXT M10
type: Collection events
type: Observation
endpoint URL: catalogue_rdf
data set: Collection events
source: LIFELINES_NEXT
resource: LIFELINES_NEXT
title: LIFELINES_NEXT M10
name: LIFELINES_NEXT M10
pid: https://umcgresearchdatacatalogue.nl/all/collections/LIFELINES_NEXT/collection-events/LIFELINES_NEXT%20M10
description: Data collection at infant's age of 10 months
source: LIFELINES_NEXT LIFELINES_NEXT Mothers
subpopulations: LIFELINES_NEXT LIFELINES_NEXT Mothers
keyword: Breast milk
keywords: Breast milk
keyword: Development
keywords: Development
keyword: Urine
keywords: Urine
keyword: Blood
keywords: Blood
keyword: Cord blood
keywords: Cord blood
keyword: Healthy ageing
keywords: Healthy ageing
keyword: Birth cohort
keywords: Birth cohort
keyword: Transgenerational effects
keywords: Transgenerational effects
keyword: Meconium
keywords: Meconium
keyword: Microbiome
keywords: Microbiome
keyword: Biobank
keywords: Biobank
keyword: Feces
keywords: Feces
start date: 2017-01-01
age groups: http://umcgresearchdatacatalogue.nl/CatalogueOntologies/api/rdf/AgeGroups/name=Young%20adult%20%2818-24%20years%29
age groups: http://umcgresearchdatacatalogue.nl/CatalogueOntologies/api/rdf/AgeGroups/name=Middle-aged%20%2845-64%20years%29
age groups: http://umcgresearchdatacatalogue.nl/CatalogueOntologies/api/rdf/AgeGroups/name=Adult%20%2825-44%20years%29
number of participants: 1450
areas of information: http://umcgresearchdatacatalogue.nl/CatalogueOntologies/api/rdf/AreasOfInformationCohorts/name=Life%20events
areas of information: http://umcgresearchdatacatalogue.nl/CatalogueOntologies/api/rdf/AreasOfInformationCohorts/name=Psychological%20distress%20and%20emotions
areas of information: http://umcgresearchdatacatalogue.nl/CatalogueOntologies/api/rdf/AreasOfInformationCohorts/name=Education
areas of information: http://umcgresearchdatacatalogue.nl/CatalogueOntologies/api/rdf/AreasOfInformationCohorts/name=Questionnaire%20and%20interview-related%20information
areas of information: http://umcgresearchdatacatalogue.nl/CatalogueOntologies/api/rdf/AreasOfInformationCohorts/name=Income%2C%20possessions%2C%20and%20benefits
areas of information: http://umcgresearchdatacatalogue.nl/CatalogueOntologies/api/rdf/AreasOfInformationCohorts/name=Work%20life
areas of information: http://umcgresearchdatacatalogue.nl/CatalogueOntologies/api/rdf/AreasOfInformationCohorts/name=Medication%20and%20supplement%20intake
data categories: http://umcgresearchdatacatalogue.nl/CatalogueOntologies/api/rdf/DataCategories/name=Survey%20data
standardized tools: http://umcgresearchdatacatalogue.nl/CatalogueOntologies/api/rdf/StandardizedTools/name=Survey%C2%A0Work-home%C2%A0Interaction%E2%80%94NijmeGen
standardized tools: http://umcgresearchdatacatalogue.nl/CatalogueOntologies/api/rdf/StandardizedTools/name=List%20of%20Threatening%20Experiences
standardized tools: http://umcgresearchdatacatalogue.nl/CatalogueOntologies/api/rdf/StandardizedTools/name=Long-term%20Difficulties%20Inventory
contact point: LIFELINES_NEXT Lifelines NEXT Contact
publisher: LIFELINES_NEXT UMCG
creator: LIFELINES_NEXT UMCG
theme: http://umcgresearchdatacatalogue.nl/CatalogueOntologies/api/rdf/Themes/name=Health
theme: HEAL
access rights: http://umcgresearchdatacatalogue.nl/CatalogueOntologies/api/rdf/AccessRights/name=Non%20public
access rights: NON PUBLIC
applicable legislation: http://umcgresearchdatacatalogue.nl/CatalogueOntologies/api/rdf/Legislations/name=Data%20Governance%20Act
applicable legislation: oj
mg_draft: false
mg_insertedOn: 2026-05-13T12:02:11
mg_updatedOn: 2026-05-13T12:02:11

LIFELINES_NEXT LIFELINES_NEXT W2
type: Collection events
type: Observation
endpoint URL: catalogue_rdf
data set: Collection events
source: LIFELINES_NEXT
resource: LIFELINES_NEXT
title: LIFELINES_NEXT W2
name: LIFELINES_NEXT W2
pid: https://umcgresearchdatacatalogue.nl/all/collections/LIFELINES_NEXT/collection-events/LIFELINES_NEXT%20W2
description: Data collection at infant's age of 2 weeks
source: LIFELINES_NEXT LIFELINES_NEXT Children
subpopulations: LIFELINES_NEXT LIFELINES_NEXT Children
keyword: Breast milk
keywords: Breast milk
keyword: Development
keywords: Development
keyword: Urine
keywords: Urine
keyword: Blood
keywords: Blood
keyword: Cord blood
keywords: Cord blood
keyword: Healthy ageing
keywords: Healthy ageing
keyword: Birth cohort
keywords: Birth cohort
keyword: Transgenerational effects
keywords: Transgenerational effects
keyword: Meconium
keywords: Meconium
keyword: Microbiome
keywords: Microbiome
keyword: Biobank
keywords: Biobank
keyword: Feces
keywords: Feces
start date: 2017-01-01
age groups: http://umcgresearchdatacatalogue.nl/CatalogueOntologies/api/rdf/AgeGroups/name=Newborn%20%280-1%20months%29
number of participants: 1380
areas of information: http://umcgresearchdatacatalogue.nl/CatalogueOntologies/api/rdf/AreasOfInformationCohorts/name=Microbiology
areas of information: http://umcgresearchdatacatalogue.nl/CatalogueOntologies/api/rdf/AreasOfInformationCohorts/name=Virology
areas of information: http://umcgresearchdatacatalogue.nl/CatalogueOntologies/api/rdf/AreasOfInformationCohorts/name=Skin%20and%20subcutaneous%20tissue
areas of information: http://umcgresearchdatacatalogue.nl/CatalogueOntologies/api/rdf/AreasOfInformationCohorts/name=Biochemistry
areas of information: http://umcgresearchdatacatalogue.nl/CatalogueOntologies/api/rdf/AreasOfInformationCohorts/name=Questionnaire%20and%20interview-related%20information
areas of information: http://umcgresearchdatacatalogue.nl/CatalogueOntologies/api/rdf/AreasOfInformationCohorts/name=Genomics
areas of information: http://umcgresearchdatacatalogue.nl/CatalogueOntologies/api/rdf/AreasOfInformationCohorts/name=Breastfeeding
areas of information: http://umcgresearchdatacatalogue.nl/CatalogueOntologies/api/rdf/AreasOfInformationCohorts/name=Nutrition
areas of information: http://umcgresearchdatacatalogue.nl/CatalogueOntologies/api/rdf/AreasOfInformationCohorts/name=Medication%20and%20supplement%20intake
data categories: http://umcgresearchdatacatalogue.nl/CatalogueOntologies/api/rdf/DataCategories/name=Genomics
data categories: http://umcgresearchdatacatalogue.nl/CatalogueOntologies/api/rdf/DataCategories/name=Biological%20samples
data categories: http://umcgresearchdatacatalogue.nl/CatalogueOntologies/api/rdf/DataCategories/name=Survey%20data
sample categories: http://umcgresearchdatacatalogue.nl/CatalogueOntologies/api/rdf/SampleCategories/name=Other%20epithelium
sample categories: http://umcgresearchdatacatalogue.nl/CatalogueOntologies/api/rdf/SampleCategories/name=Milk%2C%20Human
sample categories: http://umcgresearchdatacatalogue.nl/CatalogueOntologies/api/rdf/SampleCategories/name=Feces
standardized tools: http://umcgresearchdatacatalogue.nl/CatalogueOntologies/api/rdf/StandardizedTools/name=Food%20Frequency%20Questionnaire
core variables: Stratum corneum
contact point: LIFELINES_NEXT Lifelines NEXT Contact
publisher: LIFELINES_NEXT UMCG
creator: LIFELINES_NEXT UMCG
theme: http://umcgresearchdatacatalogue.nl/CatalogueOntologies/api/rdf/Themes/name=Health
theme: HEAL
access rights: http://umcgresearchdatacatalogue.nl/CatalogueOntologies/api/rdf/AccessRights/name=Non%20public
access rights: NON PUBLIC
applicable legislation: http://umcgresearchdatacatalogue.nl/CatalogueOntologies/api/rdf/Legislations/name=Data%20Governance%20Act
applicable legislation: oj
mg_draft: false
mg_insertedOn: 2026-05-13T12:02:11
mg_updatedOn: 2026-05-13T12:02:11

LIFELINES_NEXT LIFELINES_NEXT Y4.5
type: Collection events
type: Observation
endpoint URL: catalogue_rdf
data set: Collection events
source: LIFELINES_NEXT
resource: LIFELINES_NEXT
title: LIFELINES_NEXT Y4.5
name: LIFELINES_NEXT Y4.5
pid: https://umcgresearchdatacatalogue.nl/all/collections/LIFELINES_NEXT/collection-events/LIFELINES_NEXT%20Y4.5
description: Data collection at infant's age of 4.5 years
source: LIFELINES_NEXT LIFELINES_NEXT Children
subpopulations: LIFELINES_NEXT LIFELINES_NEXT Children
keyword: Breast milk
keywords: Breast milk
keyword: Development
keywords: Development
keyword: Urine
keywords: Urine
keyword: Blood
keywords: Blood
keyword: Cord blood
keywords: Cord blood
keyword: Healthy ageing
keywords: Healthy ageing
keyword: Birth cohort
keywords: Birth cohort
keyword: Transgenerational effects
keywords: Transgenerational effects
keyword: Meconium
keywords: Meconium
keyword: Microbiome
keywords: Microbiome
keyword: Biobank
keywords: Biobank
keyword: Feces
keywords: Feces
start date: 2022-01-01
age groups: http://umcgresearchdatacatalogue.nl/CatalogueOntologies/api/rdf/AgeGroups/name=Child%20%282-12%20years%29
number of participants: 1380
areas of information: http://umcgresearchdatacatalogue.nl/CatalogueOntologies/api/rdf/AreasOfInformationCohorts/name=Questionnaire%20and%20interview-related%20information
areas of information: http://umcgresearchdatacatalogue.nl/CatalogueOntologies/api/rdf/AreasOfInformationCohorts/name=Life%20course%20development
data categories: http://umcgresearchdatacatalogue.nl/CatalogueOntologies/api/rdf/DataCategories/name=Survey%20data
standardized tools: http://umcgresearchdatacatalogue.nl/CatalogueOntologies/api/rdf/StandardizedTools/name=Ages%20and%20Stages%20Questionnaire
contact point: LIFELINES_NEXT Lifelines NEXT Contact
publisher: LIFELINES_NEXT UMCG
creator: LIFELINES_NEXT UMCG
theme: http://umcgresearchdatacatalogue.nl/CatalogueOntologies/api/rdf/Themes/name=Health
theme: HEAL
access rights: http://umcgresearchdatacatalogue.nl/CatalogueOntologies/api/rdf/AccessRights/name=Non%20public
access rights: NON PUBLIC
applicable legislation: http://umcgresearchdatacatalogue.nl/CatalogueOntologies/api/rdf/Legislations/name=Data%20Governance%20Act
applicable legislation: oj
mg_draft: false
mg_insertedOn: 2026-05-13T12:02:11
mg_updatedOn: 2026-05-13T12:02:11

LIFELINES_NEXT LIFELINES_NEXT Y5.5
type: Collection events
type: Observation
endpoint URL: catalogue_rdf
data set: Collection events
source: LIFELINES_NEXT
resource: LIFELINES_NEXT
title: LIFELINES_NEXT Y5.5
name: LIFELINES_NEXT Y5.5
pid: https://umcgresearchdatacatalogue.nl/all/collections/LIFELINES_NEXT/collection-events/LIFELINES_NEXT%20Y5.5
description: Data collection at infant's age of 5.5 years
source: LIFELINES_NEXT LIFELINES_NEXT Children
subpopulations: LIFELINES_NEXT LIFELINES_NEXT Children
keyword: Breast milk
keywords: Breast milk
keyword: Development
keywords: Development
keyword: Urine
keywords: Urine
keyword: Blood
keywords: Blood
keyword: Cord blood
keywords: Cord blood
keyword: Healthy ageing
keywords: Healthy ageing
keyword: Birth cohort
keywords: Birth cohort
keyword: Transgenerational effects
keywords: Transgenerational effects
keyword: Meconium
keywords: Meconium
keyword: Microbiome
keywords: Microbiome
keyword: Biobank
keywords: Biobank
keyword: Feces
keywords: Feces
start date: 2022-01-01
age groups: http://umcgresearchdatacatalogue.nl/CatalogueOntologies/api/rdf/AgeGroups/name=Child%20%282-12%20years%29
number of participants: 1380
areas of information: http://umcgresearchdatacatalogue.nl/CatalogueOntologies/api/rdf/AreasOfInformationCohorts/name=Questionnaire%20and%20interview-related%20information
areas of information: http://umcgresearchdatacatalogue.nl/CatalogueOntologies/api/rdf/AreasOfInformationCohorts/name=Life%20course%20development
data categories: http://umcgresearchdatacatalogue.nl/CatalogueOntologies/api/rdf/DataCategories/name=Survey%20data
standardized tools: http://umcgresearchdatacatalogue.nl/CatalogueOntologies/api/rdf/StandardizedTools/name=Ages%20and%20Stages%20Questionnaire
contact point: LIFELINES_NEXT Lifelines NEXT Contact
publisher: LIFELINES_NEXT UMCG
creator: LIFELINES_NEXT UMCG
theme: http://umcgresearchdatacatalogue.nl/CatalogueOntologies/api/rdf/Themes/name=Health
theme: HEAL
access rights: http://umcgresearchdatacatalogue.nl/CatalogueOntologies/api/rdf/AccessRights/name=Non%20public
access rights: NON PUBLIC
applicable legislation: http://umcgresearchdatacatalogue.nl/CatalogueOntologies/api/rdf/Legislations/name=Data%20Governance%20Act
applicable legislation: oj
mg_draft: false
mg_insertedOn: 2026-05-13T12:02:11
mg_updatedOn: 2026-05-13T12:02:11

OncoLifeS OncoLifeS Baseline
type: Collection events
type: Observation
endpoint URL: catalogue_rdf
data set: Collection events
source: OncoLifeS
resource: OncoLifeS
title: OncoLifeS Baseline
name: OncoLifeS Baseline
pid: https://umcgresearchdatacatalogue.nl/all/collections/OncoLifeS/collection-events/OncoLifeS%20Baseline
description: Collection at inclusion
source: OncoLifeS OncoLifeS Adolescents and young adults (AYA)
subpopulations: OncoLifeS OncoLifeS Adolescents and young adults (AYA)
source: OncoLifeS OncoLifeS Esophageal and Stomach Carcinoma
subpopulations: OncoLifeS OncoLifeS Esophageal and Stomach Carcinoma
source: OncoLifeS OncoLifeS Head&Neck cancer
subpopulations: OncoLifeS OncoLifeS Head&Neck cancer
source: OncoLifeS OncoLifeS Hepato Pancreato Biliary Tumors
subpopulations: OncoLifeS OncoLifeS Hepato Pancreato Biliary Tumors
source: OncoLifeS OncoLifeS Testicular oncology
subpopulations: OncoLifeS OncoLifeS Testicular oncology
source: OncoLifeS OncoLifeS Gynecological oncology
subpopulations: OncoLifeS OncoLifeS Gynecological oncology
source: OncoLifeS OncoLifeS Neuro-endocrine oncology
subpopulations: OncoLifeS OncoLifeS Neuro-endocrine oncology
source: OncoLifeS OncoLifeS Lung oncology
subpopulations: OncoLifeS OncoLifeS Lung oncology
source: OncoLifeS OncoLifeS Skin cancer
subpopulations: OncoLifeS OncoLifeS Skin cancer
source: OncoLifeS OncoLifeS Adrenal cancer
subpopulations: OncoLifeS OncoLifeS Adrenal cancer
source: OncoLifeS OncoLifeS Medical oncology/immunotherapy
subpopulations: OncoLifeS OncoLifeS Medical oncology/immunotherapy
source: OncoLifeS OncoLifeS Anaplastic thyroid carcinoma
subpopulations: OncoLifeS OncoLifeS Anaplastic thyroid carcinoma
source: OncoLifeS OncoLifeS Bone and soft-tissue oncology
subpopulations: OncoLifeS OncoLifeS Bone and soft-tissue oncology
source: OncoLifeS OncoLifeS Hematological oncology
subpopulations: OncoLifeS OncoLifeS Hematological oncology
source: OncoLifeS OncoLifeS Colorectal cancer
subpopulations: OncoLifeS OncoLifeS Colorectal cancer
source: OncoLifeS OncoLifeS Neuro-oncology
subpopulations: OncoLifeS OncoLifeS Neuro-oncology
source: OncoLifeS OncoLifeS Hereditary Breast and Ovarian Cancer
subpopulations: OncoLifeS OncoLifeS Hereditary Breast and Ovarian Cancer
keyword: Oncology Surgery
keywords: Oncology Surgery
keyword: Biomaterial processing
keywords: Biomaterial processing
keyword: Dermatological cancer
keywords: Dermatological cancer
keyword: Long-term outcome data
keywords: Long-term outcome data
keyword: Patient characteristics
keywords: Patient characteristics
keyword: Quality of life data
keywords: Quality of life data
keyword: lung oncology
keywords: lung oncology
keyword: Patient reported data
keywords: Patient reported data
keyword: Treatment response
keywords: Treatment response
keyword: Cancer Research Centre
keywords: Cancer Research Centre
keyword: Adolescents and young adults with cancer
keywords: Adolescents and young adults with cancer
keyword: Hereditary increased risk of breast and ovarian cancer
keywords: Hereditary increased risk of breast and ovarian cancer
keyword: Neuroendocrine tumors
keywords: Neuroendocrine tumors
keyword: Imaging data
keywords: Imaging data
keyword: Dutch Trial Register
keywords: Dutch Trial Register
keyword: gynecological oncology
keywords: gynecological oncology
keyword: Quality of care
keywords: Quality of care
keyword: Quality of life

OncoLifeS OncoLifeS Follow-up 6 - 12- 18- 24 months
type: Collection events
type: Observation
endpoint URL: catalogue_rdf
data set: Collection events
source: OncoLifeS
resource: OncoLifeS
title: OncoLifeS Follow-up 6 - 12- 18- 24 months
name: OncoLifeS Follow-up 6 - 12- 18- 24 months
pid: https://umcgresearchdatacatalogue.nl/all/collections/OncoLifeS/collection-events/OncoLifeS%20Follow-up%206%20-%2012-%2018-%2024%20months
description: We have established a hospital-based data-biobank, entitled OncoLifeS (Oncological Life Study: Living well as a cancer survivor) to link routinely collected clinical data with preserved biological specimens and quality of life assessments. The OncoLifeS data-biobank has been designed to facilitate cancer research by providing clear phenotypic and genotypic data in a clinical context. Observational study involves collecting routine clinical data about carefully selected patient groups, and this can be combined with genetics and omics data from biological specimens. Indeed, understanding cancer heterogeneity, its temporal evolution over time, and the outcomes of guided treatment depend on accurate data about patient characteristics and their clinical management. Linking these routine clinical data to preserved biological specimens can then enable reproducible research capable of discovering biomarkers of cancer and/or treatment response, evaluating personalized treatment approaches, and increasing patient awareness. Including quality of life assessments may provide relevant information on how cancer and its treatment affects the subjective well-being of patients.
source: OncoLifeS OncoLifeS Hepato Pancreato Biliary Tumors
subpopulations: OncoLifeS OncoLifeS Hepato Pancreato Biliary Tumors
source: OncoLifeS OncoLifeS Adolescents and young adults (AYA)
subpopulations: OncoLifeS OncoLifeS Adolescents and young adults (AYA)
source: OncoLifeS OncoLifeS Hematological oncology
subpopulations: OncoLifeS OncoLifeS Hematological oncology
source: OncoLifeS OncoLifeS Bone and soft-tissue oncology
subpopulations: OncoLifeS OncoLifeS Bone and soft-tissue oncology
source: OncoLifeS OncoLifeS Anaplastic thyroid carcinoma
subpopulations: OncoLifeS OncoLifeS Anaplastic thyroid carcinoma
source: OncoLifeS OncoLifeS Neuro-endocrine oncology
subpopulations: OncoLifeS OncoLifeS Neuro-endocrine oncology
source: OncoLifeS OncoLifeS Medical oncology/immunotherapy
subpopulations: OncoLifeS OncoLifeS Medical oncology/immunotherapy
source: OncoLifeS OncoLifeS Testicular oncology
subpopulations: OncoLifeS OncoLifeS Testicular oncology
source: OncoLifeS OncoLifeS Head&Neck cancer
subpopulations: OncoLifeS OncoLifeS Head&Neck cancer
source: OncoLifeS OncoLifeS Neuro-oncology
subpopulations: OncoLifeS OncoLifeS Neuro-oncology
source: OncoLifeS OncoLifeS Gynecological oncology
subpopulations: OncoLifeS OncoLifeS Gynecological oncology
source: OncoLifeS OncoLifeS Adrenal cancer
subpopulations: OncoLifeS OncoLifeS Adrenal cancer
source: OncoLifeS OncoLifeS Colorectal cancer
subpopulations: OncoLifeS OncoLifeS Colorectal cancer
source: OncoLifeS OncoLifeS Esophageal and Stomach Carcinoma
subpopulations: OncoLifeS OncoLifeS Esophageal and Stomach Carcinoma
source: OncoLifeS OncoLifeS Lung oncology
subpopulations: OncoLifeS OncoLifeS Lung oncology
keyword: Oncology Surgery
keywords: Oncology Surgery
keyword: Biomaterial processing
keywords: Biomaterial processing
keyword: Dermatological cancer
keywords: Dermatological cancer
keyword: Long-term outcome data
keywords: Long-term outcome data
keyword: Patient characteristics
keywords: Patient characteristics
keyword: Quality of life data
keywords: Quality of life data
keyword: lung oncology
keywords: lung oncology
keyword: Patient reported data
keywords: Patient reported data
keyword: Treatment response
keywords: Treatment response
keyword: Cancer Research Centre
keywords: Cancer Research Centre
keyword: Adolescents and young adults with cancer
keywords: Adolescents and young adults with cancer
keyword: Hereditary increased risk of breast and ovarian cancer
keywords: Hereditary increased risk of breast and ovarian cancer
keyword: Neuroendocrine tumors
keywords: Neuroendocrine tumors
keyword: Imaging data
keywords: Imaging data
keyword: Dutch Trial Register
keywords: Dutch Trial Register
keyword: gynecological oncology
keywords: gynecological oncology
keyword: Quality of care
keywords: Quality of care
keyword: Quality of life
keywords: Quality of life
keyword: European reference network on rare cancers (EURACAN)
keywords: European reference network on rare cancers (EURACAN)
keyword: Translational research

PSI IBD PSI IBD Clinical data
type: Collection events
type: Observation
endpoint URL: catalogue_rdf
data set: Collection events
source: PSI IBD
resource: PSI IBD
title: PSI IBD Clinical data
name: PSI IBD Clinical data
pid: https://umcgresearchdatacatalogue.nl/all/collections/PSI%20IBD/collection-events/PSI%20IBD%20Clinical%20data
description: Prospective collection of clinical data
keyword: IBD Crohn's disease
keywords: IBD Crohn's disease
keyword: Genome
keywords: Genome
keyword: Exposome
keywords: Exposome
keyword: Multiomics
keywords: Multiomics
keyword: Ulcerative colitis
keywords: Ulcerative colitis
keyword: Microbiome
keywords: Microbiome
keyword: IBD-undetermined
keywords: IBD-undetermined
keyword: Inflammatory Bowel Disease
keywords: Inflammatory Bowel Disease
start date: 2008-01-01
age groups: http://umcgresearchdatacatalogue.nl/CatalogueOntologies/api/rdf/AgeGroups/name=Aged%20%2880%2B%20years%29
age groups: http://umcgresearchdatacatalogue.nl/CatalogueOntologies/api/rdf/AgeGroups/name=Aged%20%2865%2B%20years%29
age groups: http://umcgresearchdatacatalogue.nl/CatalogueOntologies/api/rdf/AgeGroups/name=Middle-aged%20%2845-64%20years%29
age groups: http://umcgresearchdatacatalogue.nl/CatalogueOntologies/api/rdf/AgeGroups/name=Adult%20%2818%2B%20years%29
age groups: http://umcgresearchdatacatalogue.nl/CatalogueOntologies/api/rdf/AgeGroups/name=Young%20adult%20%2818-24%20years%29
age groups: http://umcgresearchdatacatalogue.nl/CatalogueOntologies/api/rdf/AgeGroups/name=Adult%20%2825-44%20years%29
age groups: http://umcgresearchdatacatalogue.nl/CatalogueOntologies/api/rdf/AgeGroups/name=Aged%20%2865-79%20years%29
number of participants: 1500
areas of information: http://umcgresearchdatacatalogue.nl/CatalogueOntologies/api/rdf/AreasOfInformationCohorts/name=Surgical%20interventions
areas of information: http://umcgresearchdatacatalogue.nl/CatalogueOntologies/api/rdf/AreasOfInformationCohorts/name=Sex%2Fgender
areas of information: http://umcgresearchdatacatalogue.nl/CatalogueOntologies/api/rdf/AreasOfInformationCohorts/name=Other%20physical%20measures%20and%20assessments
areas of information: http://umcgresearchdatacatalogue.nl/CatalogueOntologies/api/rdf/AreasOfInformationCohorts/name=Hematology
areas of information: http://umcgresearchdatacatalogue.nl/CatalogueOntologies/api/rdf/AreasOfInformationCohorts/name=Medication%20and%20supplement%20intake
areas of information: http://umcgresearchdatacatalogue.nl/CatalogueOntologies/api/rdf/AreasOfInformationCohorts/name=Cognitive%2C%20psychological%20and%20sensory%20interventions
areas of information: http://umcgresearchdatacatalogue.nl/CatalogueOntologies/api/rdf/AreasOfInformationCohorts/name=Cause%20of%20death
areas of information: http://umcgresearchdatacatalogue.nl/CatalogueOntologies/api/rdf/AreasOfInformationCohorts/name=Perception%20of%20health%2C%20quality%20of%20life%2C%20development%20and%20functional%20limitations
areas of information: http://umcgresearchdatacatalogue.nl/CatalogueOntologies/api/rdf/AreasOfInformationCohorts/name=Virology
areas of information: http://umcgresearchdatacatalogue.nl/CatalogueOntologies/api/rdf/AreasOfInformationCohorts/name=Medication%20and%20supplements
areas of information: http://umcgresearchdatacatalogue.nl/CatalogueOntologies/api/rdf/AreasOfInformationCohorts/name=Muscles%2C%20skeleton%20and%20mobility
areas of information: http://umcgresearchdatacatalogue.nl/CatalogueOntologies/api/rdf/AreasOfInformationCohorts/name=Other%20end%20of%20life%20or%20death-related%20information
areas of information: http://umcgresearchdatacatalogue.nl/CatalogueOntologies/api/rdf/AreasOfInformationCohorts/name=Marital%2Fpartner%20status
areas of information: http://umcgresearchdatacatalogue.nl/CatalogueOntologies/api/rdf/AreasOfInformationCohorts/name=Quality%20of%20life
areas of information: http://umcgresearchdatacatalogue.nl/CatalogueOntologies/api/rdf/AreasOfInformationCohorts/name=Hospitalizations
areas of information: http://umcgresearchdatacatalogue.nl/CatalogueOntologies/api/rdf/AreasOfInformationCohorts/name=Physical%20therapy%20interventions
areas of information: http://umcgresearchdatacatalogue.nl/CatalogueOntologies/api/rdf/AreasOfInformationCohorts/name=Reproduction
areas of information: http://umcgresearchdatacatalogue.nl/CatalogueOntologies/api/rdf/AreasOfInformationCohorts/name=Microbiology
areas of information: http://umcgresearchdatacatalogue.nl/CatalogueOntologies/api/rdf/AreasOfInformationCohorts/name=Digestion
areas of information: http://umcgresearchdatacatalogue.nl/CatalogueOntologies/api/rdf/AreasOfInformationCohorts/name=Radiotherapy%20interventions
areas of information: http://umcgresearchdatacatalogue.nl/CatalogueOntologies/api/rdf/AreasOfInformationCohorts/name=Chemotherapy%20interventions
areas of information: http://umcgresearchdatacatalogue.nl/CatalogueOntologies/api/rdf/AreasOfInformationCohorts/name=Biochemistry
areas of information: http://umcgresearchdatacatalogue.nl/CatalogueOntologies/api/rdf/AreasOfInformationCohorts/name=Anthropometry
areas of information: http://umcgresearchdatacatalogue.nl/CatalogueOntologies/api/rdf/AreasOfInformationCohorts/name=Brain%20and%20nerves
areas of information: http://umcgresearchdatacatalogue.nl/CatalogueOntologies/api/rdf/AreasOfInformationCohorts/name=Other%20and%20unspecified%20pharmacological%20interventions
areas of information: http://umcgresearchdatacatalogue.nl/CatalogueOntologies/api/rdf/AreasOfInformationCohorts/name=Histology
areas of information: http://umcgresearchdatacatalogue.nl/CatalogueOntologies/api/rdf/AreasOfInformationCohorts/name=Education
areas of information: http://umcgresearchdatacatalogue.nl/CatalogueOntologies/api/rdf/AreasOfInformationCohorts/name=Other%20laboratory%20measures
areas of information: http://umcgresearchdatacatalogue.nl/CatalogueOntologies/api/rdf/AreasOfInformationCohorts/name=Skin%20and%20subcutaneous%20tissue
areas of information: http://umcgresearchdatacatalogue.nl/CatalogueOntologies/api/rdf/AreasOfInformationCohorts/name=Use%20of%20assistive%20devices
areas of information: http://umcgresearchdatacatalogue.nl/CatalogueOntologies/api/rdf/AreasOfInformationCohorts/name=Genomics
areas of information: http://umcgresearchdatacatalogue.nl/CatalogueOntologies/api/rdf/AreasOfInformationCohorts/name=Circulation%20and%20respiration
areas of information: http://umcgresearchdatacatalogue.nl/CatalogueOntologies/api/rdf/AreasOfInformationCohorts/name=Age%2Fbirthdate
areas of information: http://umcgresearchdatacatalogue.nl/CatalogueOntologies/api/rdf/AreasOfInformationCohorts/name=Ethnicity%2C%20race%20and%20religion
areas of information: http://umcgresearchdatacatalogue.nl/CatalogueOntologies/api/rdf/AreasOfInformationCohorts/name=Laboratory%20diagnosis%20interventions
areas of information: http://umcgresearchdatacatalogue.nl/CatalogueOntologies/api/rdf/AreasOfInformationCohorts/name=Labour%20force%20and%20retirement
areas of information: http://umcgresearchdatacatalogue.nl/CatalogueOntologies/api/rdf/AreasOfInformationCohorts/name=Life%20course%20development
areas of information: http://umcgresearchdatacatalogue.nl/CatalogueOntologies/api/rdf/AreasOfInformationCohorts/name=Health%20and%20community%20care%20services%20utilization
areas of information: http://umcgresearchdatacatalogue.nl/CatalogueOntologies/api/rdf/AreasOfInformationCohorts/name=Vital%20status
areas of information: http://umcgresearchdatacatalogue.nl/CatalogueOntologies/api/rdf/AreasOfInformationCohorts/name=Residence
areas of information: http://umcgresearchdatacatalogue.nl/CatalogueOntologies/api/rdf/AreasOfInformationCohorts/name=Language
areas of information: http://umcgresearchdatacatalogue.nl/CatalogueOntologies/api/rdf/AreasOfInformationCohorts/name=Citizenship%20and%20immigrant%20status
areas of information: http://umcgresearchdatacatalogue.nl/CatalogueOntologies/api/rdf/AreasOfInformationCohorts/name=Sensory%20and%20pain
areas of information: http://umcgresearchdatacatalogue.nl/CatalogueOntologies/api/rdf/AreasOfInformationCohorts/name=Laboratory%20measures

PSI IBD PSI IBD Biomaterial
type: Collection events
type: Observation
endpoint URL: catalogue_rdf
data set: Collection events
source: PSI IBD
resource: PSI IBD
title: PSI IBD Biomaterial
name: PSI IBD Biomaterial
pid: https://umcgresearchdatacatalogue.nl/all/collections/PSI%20IBD/collection-events/PSI%20IBD%20Biomaterial
description: Serum samples, plasma samples, intestinal biopsies and resection materials
source: PSI IBD PSI IBD
subpopulations: PSI IBD PSI IBD
keyword: IBD Crohn's disease
keywords: IBD Crohn's disease
keyword: Genome
keywords: Genome
keyword: Exposome
keywords: Exposome
keyword: Multiomics
keywords: Multiomics
keyword: Ulcerative colitis
keywords: Ulcerative colitis
keyword: Microbiome
keywords: Microbiome
keyword: IBD-undetermined
keywords: IBD-undetermined
keyword: Inflammatory Bowel Disease
keywords: Inflammatory Bowel Disease
start date: 2008-01-01
age groups: http://umcgresearchdatacatalogue.nl/CatalogueOntologies/api/rdf/AgeGroups/name=Aged%20%2880%2B%20years%29
age groups: http://umcgresearchdatacatalogue.nl/CatalogueOntologies/api/rdf/AgeGroups/name=Aged%20%2865%2B%20years%29
age groups: http://umcgresearchdatacatalogue.nl/CatalogueOntologies/api/rdf/AgeGroups/name=Middle-aged%20%2845-64%20years%29
age groups: http://umcgresearchdatacatalogue.nl/CatalogueOntologies/api/rdf/AgeGroups/name=Adult%20%2818%2B%20years%29
age groups: http://umcgresearchdatacatalogue.nl/CatalogueOntologies/api/rdf/AgeGroups/name=Young%20adult%20%2818-24%20years%29
age groups: http://umcgresearchdatacatalogue.nl/CatalogueOntologies/api/rdf/AgeGroups/name=Adult%20%2825-44%20years%29
age groups: http://umcgresearchdatacatalogue.nl/CatalogueOntologies/api/rdf/AgeGroups/name=Aged%20%2865-79%20years%29
number of participants: 1500
data categories: http://umcgresearchdatacatalogue.nl/CatalogueOntologies/api/rdf/DataCategories/name=Biological%20samples
sample categories: http://umcgresearchdatacatalogue.nl/CatalogueOntologies/api/rdf/SampleCategories/name=Gallbladder%20-%20Tissue%20%28Organo%C3%AFds%29
sample categories: http://umcgresearchdatacatalogue.nl/CatalogueOntologies/api/rdf/SampleCategories/name=Urine%2C%20random
sample categories: http://umcgresearchdatacatalogue.nl/CatalogueOntologies/api/rdf/SampleCategories/name=Rectum%20-%20Tissue%20%28FFPE%29
sample categories: http://umcgresearchdatacatalogue.nl/CatalogueOntologies/api/rdf/SampleCategories/name=Esophagus%20-%20Tissue%20%28Organo%C3%AFds%29
sample categories: http://umcgresearchdatacatalogue.nl/CatalogueOntologies/api/rdf/SampleCategories/name=Blood%20Buffy%20Coat
sample categories: http://umcgresearchdatacatalogue.nl/CatalogueOntologies/api/rdf/SampleCategories/name=Stomach%20-%20Tissue%20%28Organo%C3%AFds%29
sample categories: http://umcgresearchdatacatalogue.nl/CatalogueOntologies/api/rdf/SampleCategories/name=Liver%20-%20Tissue%20%28Organo%C3%AFds%29
sample categories: http://umcgresearchdatacatalogue.nl/CatalogueOntologies/api/rdf/SampleCategories/name=Stomach%20-%20Tissue%20%28FFPE%29
sample categories: http://umcgresearchdatacatalogue.nl/CatalogueOntologies/api/rdf/SampleCategories/name=Salivary%20Glands%20-%20Tissue%20%28FFPE%29
sample categories: http://umcgresearchdatacatalogue.nl/CatalogueOntologies/api/rdf/SampleCategories/name=Liver%20-%20Tissue%20%28FFPE%29
sample categories: http://umcgresearchdatacatalogue.nl/CatalogueOntologies/api/rdf/SampleCategories/name=Mesentery%20-%20Tissue%20%28FFPE%29
sample categories: http://umcgresearchdatacatalogue.nl/CatalogueOntologies/api/rdf/SampleCategories/name=Urine%2C%20first%20morning
sample categories: http://umcgresearchdatacatalogue.nl/CatalogueOntologies/api/rdf/SampleCategories/name=Intestine%2C%20Large%20-%20Tissue%20%28Organo%C3%AFds%29
sample categories: http://umcgresearchdatacatalogue.nl/CatalogueOntologies/api/rdf/SampleCategories/name=Intestine%2C%20Large%20-%20Tissue%20%28FFPE%29
sample categories: http://umcgresearchdatacatalogue.nl/CatalogueOntologies/api/rdf/SampleCategories/name=Urine%2C%20timed
sample categories: http://umcgresearchdatacatalogue.nl/CatalogueOntologies/api/rdf/SampleCategories/name=Pharynx%20-%20Tissue%20%28FFPE%29
sample categories: http://umcgresearchdatacatalogue.nl/CatalogueOntologies/api/rdf/SampleCategories/name=Gallbladder%20-%20Tissue%20%28FFPE%29
sample categories: http://umcgresearchdatacatalogue.nl/CatalogueOntologies/api/rdf/SampleCategories/name=Plasma
sample categories: http://umcgresearchdatacatalogue.nl/CatalogueOntologies/api/rdf/SampleCategories/name=Lower%20Gastrointestinal%20Tract%20-%20Tissue%20%28FFPE%29
sample categories: http://umcgresearchdatacatalogue.nl/CatalogueOntologies/api/rdf/SampleCategories/name=Digestive%20System%20-%20Tissue%20%28Organo%C3%AFds%29
sample categories: http://umcgresearchdatacatalogue.nl/CatalogueOntologies/api/rdf/SampleCategories/name=Fibroblasts
sample categories: http://umcgresearchdatacatalogue.nl/CatalogueOntologies/api/rdf/SampleCategories/name=Pancreas%20-%20Tissue%20%28Organo%C3%AFds%29
sample categories: http://umcgresearchdatacatalogue.nl/CatalogueOntologies/api/rdf/SampleCategories/name=Digestive%20System%20-%20Tissue%20%28FFPE%29
sample categories: http://umcgresearchdatacatalogue.nl/CatalogueOntologies/api/rdf/SampleCategories/name=Urine
sample categories: http://umcgresearchdatacatalogue.nl/CatalogueOntologies/api/rdf/SampleCategories/name=Pharynx%20-%20Tissue%20%28Organo%C3%AFds%29
sample categories: http://umcgresearchdatacatalogue.nl/CatalogueOntologies/api/rdf/SampleCategories/name=Intestine%2C%20Small%20-%20Tissue%20%28Organo%C3%AFds%29
sample categories: http://umcgresearchdatacatalogue.nl/CatalogueOntologies/api/rdf/SampleCategories/name=Blood
sample categories: http://umcgresearchdatacatalogue.nl/CatalogueOntologies/api/rdf/SampleCategories/name=Mouth%20-%20Tissue%20%28FFPE%29
sample categories: http://umcgresearchdatacatalogue.nl/CatalogueOntologies/api/rdf/SampleCategories/name=Serum
sample categories: http://umcgresearchdatacatalogue.nl/CatalogueOntologies/api/rdf/SampleCategories/name=24h%20urine
sample categories: http://umcgresearchdatacatalogue.nl/CatalogueOntologies/api/rdf/SampleCategories/name=Esophagus%20-%20Tissue%20%28FFPE%29
sample categories: http://umcgresearchdatacatalogue.nl/CatalogueOntologies/api/rdf/SampleCategories/name=Salivary%20Glands%20-%20Tissue%20%28Organo%C3%AFds%29
sample categories: http://umcgresearchdatacatalogue.nl/CatalogueOntologies/api/rdf/SampleCategories/name=Lower%20Gastrointestinal%20Tract%20-%20Tissue%20%28Organo%C3%AFds%29
sample categories: http://umcgresearchdatacatalogue.nl/CatalogueOntologies/api/rdf/SampleCategories/name=Mouth%20-%20Tissue%20%28Organo%C3%AFds%29
sample categories: http://umcgresearchdatacatalogue.nl/CatalogueOntologies/api/rdf/SampleCategories/name=Intestine%2C%20Small%20-%20Tissue%20%28FFPE%29
sample categories: http://umcgresearchdatacatalogue.nl/CatalogueOntologies/api/rdf/SampleCategories/name=Blood%20%28whole%29
sample categories: http://umcgresearchdatacatalogue.nl/CatalogueOntologies/api/rdf/SampleCategories/name=Rectum%20-%20Tissue%20%28Organo%C3%AFds%29
sample categories: http://umcgresearchdatacatalogue.nl/CatalogueOntologies/api/rdf/SampleCategories/name=Pancreas%20-%20Tissue%20%28FFPE%29
sample categories: http://umcgresearchdatacatalogue.nl/CatalogueOntologies/api/rdf/SampleCategories/name=Mesentery%20-%20Tissue%20%28Organo%C3%AFds%29
sample categories: http://umcgresearchdatacatalogue.nl/CatalogueOntologies/api/rdf/SampleCategories/name=Fetal%20blood%20%28Cord%20blood%29
contact point: PSI IBD Kim Sloot

PSI IBD PSI IBD Genome
type: Collection events
type: Observation
endpoint URL: catalogue_rdf
data set: Collection events
source: PSI IBD
resource: PSI IBD
title: PSI IBD Genome
name: PSI IBD Genome
pid: https://umcgresearchdatacatalogue.nl/all/collections/PSI%20IBD/collection-events/PSI%20IBD%20Genome
description: Genetic data
source: PSI IBD PSI IBD
subpopulations: PSI IBD PSI IBD
keyword: IBD Crohn's disease
keywords: IBD Crohn's disease
keyword: Genome
keywords: Genome
keyword: Exposome
keywords: Exposome
keyword: Multiomics
keywords: Multiomics
keyword: Ulcerative colitis
keywords: Ulcerative colitis
keyword: Microbiome
keywords: Microbiome
keyword: IBD-undetermined
keywords: IBD-undetermined
keyword: Inflammatory Bowel Disease
keywords: Inflammatory Bowel Disease
start date: 2008-01-01
age groups: http://umcgresearchdatacatalogue.nl/CatalogueOntologies/api/rdf/AgeGroups/name=Aged%20%2880%2B%20years%29
age groups: http://umcgresearchdatacatalogue.nl/CatalogueOntologies/api/rdf/AgeGroups/name=Aged%20%2865%2B%20years%29
age groups: http://umcgresearchdatacatalogue.nl/CatalogueOntologies/api/rdf/AgeGroups/name=Middle-aged%20%2845-64%20years%29
age groups: http://umcgresearchdatacatalogue.nl/CatalogueOntologies/api/rdf/AgeGroups/name=Adult%20%2818%2B%20years%29
age groups: http://umcgresearchdatacatalogue.nl/CatalogueOntologies/api/rdf/AgeGroups/name=Young%20adult%20%2818-24%20years%29
age groups: http://umcgresearchdatacatalogue.nl/CatalogueOntologies/api/rdf/AgeGroups/name=Adult%20%2825-44%20years%29
age groups: http://umcgresearchdatacatalogue.nl/CatalogueOntologies/api/rdf/AgeGroups/name=Aged%20%2865-79%20years%29
number of participants: 1200
areas of information: http://umcgresearchdatacatalogue.nl/CatalogueOntologies/api/rdf/AreasOfInformationCohorts/name=Genomics
data categories: http://umcgresearchdatacatalogue.nl/CatalogueOntologies/api/rdf/DataCategories/name=Genomics
data categories: http://umcgresearchdatacatalogue.nl/CatalogueOntologies/api/rdf/DataCategories/name=Omics
data categories: http://umcgresearchdatacatalogue.nl/CatalogueOntologies/api/rdf/DataCategories/name=Metabolomics
data categories: http://umcgresearchdatacatalogue.nl/CatalogueOntologies/api/rdf/DataCategories/name=Proteomics
data categories: http://umcgresearchdatacatalogue.nl/CatalogueOntologies/api/rdf/DataCategories/name=Transcriptomics
sample categories: http://umcgresearchdatacatalogue.nl/CatalogueOntologies/api/rdf/SampleCategories/name=Genetic%20material
sample categories: http://umcgresearchdatacatalogue.nl/CatalogueOntologies/api/rdf/SampleCategories/name=DNA%2C%20Mitochondrial
sample categories: http://umcgresearchdatacatalogue.nl/CatalogueOntologies/api/rdf/SampleCategories/name=RNA
sample categories: http://umcgresearchdatacatalogue.nl/CatalogueOntologies/api/rdf/SampleCategories/name=DNA
contact point: PSI IBD Kim Sloot
publisher: PSI IBD UMCG
creator: PSI IBD ICC
creator: PSI IBD UMCG
creator: PSI IBD HealthRI
theme: http://umcgresearchdatacatalogue.nl/CatalogueOntologies/api/rdf/Themes/name=Health
theme: HEAL
access rights: http://umcgresearchdatacatalogue.nl/CatalogueOntologies/api/rdf/AccessRights/name=Non%20public
access rights: NON PUBLIC
applicable legislation: http://umcgresearchdatacatalogue.nl/CatalogueOntologies/api/rdf/Legislations/name=Data%20Governance%20Act
applicable legislation: oj
mg_draft: false
mg_insertedOn: 2026-05-13T12:02:11
mg_updatedOn: 2026-05-13T12:02:11

PSI IBD PSI IBD Exposome
type: Collection events
type: Observation
endpoint URL: catalogue_rdf
data set: Collection events
source: PSI IBD
resource: PSI IBD
title: PSI IBD Exposome
name: PSI IBD Exposome
pid: https://umcgresearchdatacatalogue.nl/all/collections/PSI%20IBD/collection-events/PSI%20IBD%20Exposome
description: Environmental- and lifestyle data collected through questionnaires
source: PSI IBD PSI IBD
subpopulations: PSI IBD PSI IBD
keyword: IBD Crohn's disease
keywords: IBD Crohn's disease
keyword: Genome
keywords: Genome
keyword: Exposome
keywords: Exposome
keyword: Multiomics
keywords: Multiomics
keyword: Ulcerative colitis
keywords: Ulcerative colitis
keyword: Microbiome
keywords: Microbiome
keyword: IBD-undetermined
keywords: IBD-undetermined
keyword: Inflammatory Bowel Disease
keywords: Inflammatory Bowel Disease
start date: 2017-01-01
end date: 2020-12-31
age groups: http://umcgresearchdatacatalogue.nl/CatalogueOntologies/api/rdf/AgeGroups/name=Aged%20%2880%2B%20years%29
age groups: http://umcgresearchdatacatalogue.nl/CatalogueOntologies/api/rdf/AgeGroups/name=Aged%20%2865%2B%20years%29
age groups: http://umcgresearchdatacatalogue.nl/CatalogueOntologies/api/rdf/AgeGroups/name=Middle-aged%20%2845-64%20years%29
age groups: http://umcgresearchdatacatalogue.nl/CatalogueOntologies/api/rdf/AgeGroups/name=Adult%20%2818%2B%20years%29
age groups: http://umcgresearchdatacatalogue.nl/CatalogueOntologies/api/rdf/AgeGroups/name=Young%20adult%20%2818-24%20years%29
age groups: http://umcgresearchdatacatalogue.nl/CatalogueOntologies/api/rdf/AgeGroups/name=Adult%20%2825-44%20years%29
age groups: http://umcgresearchdatacatalogue.nl/CatalogueOntologies/api/rdf/AgeGroups/name=Aged%20%2865-79%20years%29
number of participants: 750
areas of information: http://umcgresearchdatacatalogue.nl/CatalogueOntologies/api/rdf/AreasOfInformationCohorts/name=Perception%20of%20health%2C%20quality%20of%20life%2C%20development%20and%20functional%20limitations
areas of information: http://umcgresearchdatacatalogue.nl/CatalogueOntologies/api/rdf/AreasOfInformationCohorts/name=Personality
areas of information: http://umcgresearchdatacatalogue.nl/CatalogueOntologies/api/rdf/AreasOfInformationCohorts/name=Sex%2Fgender
areas of information: http://umcgresearchdatacatalogue.nl/CatalogueOntologies/api/rdf/AreasOfInformationCohorts/name=Socio-demographic%20and%20economic%20characteristics
areas of information: http://umcgresearchdatacatalogue.nl/CatalogueOntologies/api/rdf/AreasOfInformationCohorts/name=Age%2Fbirthdate
areas of information: http://umcgresearchdatacatalogue.nl/CatalogueOntologies/api/rdf/AreasOfInformationCohorts/name=Preschool%20life
areas of information: http://umcgresearchdatacatalogue.nl/CatalogueOntologies/api/rdf/AreasOfInformationCohorts/name=Personal%20hygiene
areas of information: http://umcgresearchdatacatalogue.nl/CatalogueOntologies/api/rdf/AreasOfInformationCohorts/name=Twin
areas of information: http://umcgresearchdatacatalogue.nl/CatalogueOntologies/api/rdf/AreasOfInformationCohorts/name=Pregnancy%2C%20delivery%20and%20birth
areas of information: http://umcgresearchdatacatalogue.nl/CatalogueOntologies/api/rdf/AreasOfInformationCohorts/name=Non-pharmacological%20interventions
areas of information: http://umcgresearchdatacatalogue.nl/CatalogueOntologies/api/rdf/AreasOfInformationCohorts/name=Radiation%20exposure
areas of information: http://umcgresearchdatacatalogue.nl/CatalogueOntologies/api/rdf/AreasOfInformationCohorts/name=Laboratory%20diagnosis%20interventions
areas of information: http://umcgresearchdatacatalogue.nl/CatalogueOntologies/api/rdf/AreasOfInformationCohorts/name=Workplace%20characteristics
areas of information: http://umcgresearchdatacatalogue.nl/CatalogueOntologies/api/rdf/AreasOfInformationCohorts/name=Language
areas of information: http://umcgresearchdatacatalogue.nl/CatalogueOntologies/api/rdf/AreasOfInformationCohorts/name=Health%20and%20community%20care%20services%20utilization
areas of information: http://umcgresearchdatacatalogue.nl/CatalogueOntologies/api/rdf/AreasOfInformationCohorts/name=Perception%20of%20health
areas of information: http://umcgresearchdatacatalogue.nl/CatalogueOntologies/api/rdf/AreasOfInformationCohorts/name=Other%20preschool%2C%20school%20or%20work%20life-related%20information
areas of information: http://umcgresearchdatacatalogue.nl/CatalogueOntologies/api/rdf/AreasOfInformationCohorts/name=Medication%20and%20supplements
areas of information: http://umcgresearchdatacatalogue.nl/CatalogueOntologies/api/rdf/AreasOfInformationCohorts/name=Built%20environment%2Fneighbourhood%20characteristics
areas of information: http://umcgresearchdatacatalogue.nl/CatalogueOntologies/api/rdf/AreasOfInformationCohorts/name=Ethnicity%2C%20race%20and%20religion
areas of information: http://umcgresearchdatacatalogue.nl/CatalogueOntologies/api/rdf/AreasOfInformationCohorts/name=Biological%20exposure
areas of information: http://umcgresearchdatacatalogue.nl/CatalogueOntologies/api/rdf/AreasOfInformationCohorts/name=Drugs
areas of information: http://umcgresearchdatacatalogue.nl/CatalogueOntologies/api/rdf/AreasOfInformationCohorts/name=Residence
areas of information: http://umcgresearchdatacatalogue.nl/CatalogueOntologies/api/rdf/AreasOfInformationCohorts/name=Birth%2C%20pregnancy%20and%20reproductive%20health%20history
areas of information: http://umcgresearchdatacatalogue.nl/CatalogueOntologies/api/rdf/AreasOfInformationCohorts/name=Social%20support
areas of information: http://umcgresearchdatacatalogue.nl/CatalogueOntologies/api/rdf/AreasOfInformationCohorts/name=Other%20social%20environment%20characteristics
areas of information: http://umcgresearchdatacatalogue.nl/CatalogueOntologies/api/rdf/AreasOfInformationCohorts/name=Visits%20to%20health%20professionals
areas of information: http://umcgresearchdatacatalogue.nl/CatalogueOntologies/api/rdf/AreasOfInformationCohorts/name=Citizenship%20and%20immigrant%20status
areas of information: http://umcgresearchdatacatalogue.nl/CatalogueOntologies/api/rdf/AreasOfInformationCohorts/name=Community%20and%20social%20care
areas of information: http://umcgresearchdatacatalogue.nl/CatalogueOntologies/api/rdf/AreasOfInformationCohorts/name=Work%20life
areas of information: http://umcgresearchdatacatalogue.nl/CatalogueOntologies/api/rdf/AreasOfInformationCohorts/name=Other%20psychological%20measures%20and%20assessments
areas of information: http://umcgresearchdatacatalogue.nl/CatalogueOntologies/api/rdf/AreasOfInformationCohorts/name=Birthplace
areas of information: http://umcgresearchdatacatalogue.nl/CatalogueOntologies/api/rdf/AreasOfInformationCohorts/name=Beliefs%20and%20values
areas of information: http://umcgresearchdatacatalogue.nl/CatalogueOntologies/api/rdf/AreasOfInformationCohorts/name=Education
areas of information: http://umcgresearchdatacatalogue.nl/CatalogueOntologies/api/rdf/AreasOfInformationCohorts/name=Other%20health%20and%20community%20care
areas of information: http://umcgresearchdatacatalogue.nl/CatalogueOntologies/api/rdf/AreasOfInformationCohorts/name=Parenting%20and%20familial%20environment
areas of information: http://umcgresearchdatacatalogue.nl/CatalogueOntologies/api/rdf/AreasOfInformationCohorts/name=Social%20participation
areas of information: http://umcgresearchdatacatalogue.nl/CatalogueOntologies/api/rdf/AreasOfInformationCohorts/name=Social%20environment%20and%20relationships
areas of information: http://umcgresearchdatacatalogue.nl/CatalogueOntologies/api/rdf/AreasOfInformationCohorts/name=Preschool%2C%20school%20and%20work%20life
areas of information: http://umcgresearchdatacatalogue.nl/CatalogueOntologies/api/rdf/AreasOfInformationCohorts/name=Use%20of%20assistive%20devices
areas of information: http://umcgresearchdatacatalogue.nl/CatalogueOntologies/api/rdf/AreasOfInformationCohorts/name=Other%20socio-demographic%20and%20economic%20characteristics

PSI IBD PSI IBD Microbiome
type: Collection events
type: Observation
endpoint URL: catalogue_rdf
data set: Collection events
source: PSI IBD
resource: PSI IBD
title: PSI IBD Microbiome
name: PSI IBD Microbiome
pid: https://umcgresearchdatacatalogue.nl/all/collections/PSI%20IBD/collection-events/PSI%20IBD%20Microbiome
description: Microbiome data
source: PSI IBD PSI IBD
subpopulations: PSI IBD PSI IBD
keyword: IBD Crohn's disease
keywords: IBD Crohn's disease
keyword: Genome
keywords: Genome
keyword: Exposome
keywords: Exposome
keyword: Multiomics
keywords: Multiomics
keyword: Ulcerative colitis
keywords: Ulcerative colitis
keyword: Microbiome
keywords: Microbiome
keyword: IBD-undetermined
keywords: IBD-undetermined
keyword: Inflammatory Bowel Disease
keywords: Inflammatory Bowel Disease
start date: 2005-01-01
number of participants: 1200
areas of information: http://umcgresearchdatacatalogue.nl/CatalogueOntologies/api/rdf/AreasOfInformationCohorts/name=Genomics
areas of information: http://umcgresearchdatacatalogue.nl/CatalogueOntologies/api/rdf/AreasOfInformationCohorts/name=Microbiology
data categories: http://umcgresearchdatacatalogue.nl/CatalogueOntologies/api/rdf/DataCategories/name=Biological%20samples
sample categories: http://umcgresearchdatacatalogue.nl/CatalogueOntologies/api/rdf/SampleCategories/name=Feces
contact point: PSI IBD Kim Sloot
publisher: PSI IBD UMCG
creator: PSI IBD ICC
creator: PSI IBD UMCG
creator: PSI IBD HealthRI
theme: http://umcgresearchdatacatalogue.nl/CatalogueOntologies/api/rdf/Themes/name=Health
theme: HEAL
access rights: http://umcgresearchdatacatalogue.nl/CatalogueOntologies/api/rdf/AccessRights/name=Non%20public
access rights: NON PUBLIC
applicable legislation: http://umcgresearchdatacatalogue.nl/CatalogueOntologies/api/rdf/Legislations/name=Data%20Governance%20Act
applicable legislation: oj
mg_draft: false
mg_insertedOn: 2026-05-13T12:02:11
mg_updatedOn: 2026-05-13T12:02:11

PSI IBD PSI IBD Diet
type: Collection events
type: Observation
endpoint URL: catalogue_rdf
data set: Collection events
source: PSI IBD
resource: PSI IBD
title: PSI IBD Diet
name: PSI IBD Diet
pid: https://umcgresearchdatacatalogue.nl/all/collections/PSI%20IBD/collection-events/PSI%20IBD%20Diet
description: Dietary data collected through questionnaires
source: PSI IBD PSI IBD
subpopulations: PSI IBD PSI IBD
keyword: IBD Crohn's disease
keywords: IBD Crohn's disease
keyword: Genome
keywords: Genome
keyword: Exposome
keywords: Exposome
keyword: Multiomics
keywords: Multiomics
keyword: Ulcerative colitis
keywords: Ulcerative colitis
keyword: Microbiome
keywords: Microbiome
keyword: IBD-undetermined
keywords: IBD-undetermined
keyword: Inflammatory Bowel Disease
keywords: Inflammatory Bowel Disease
start date: 2018-01-01
age groups: http://umcgresearchdatacatalogue.nl/CatalogueOntologies/api/rdf/AgeGroups/name=Aged%20%2880%2B%20years%29
age groups: http://umcgresearchdatacatalogue.nl/CatalogueOntologies/api/rdf/AgeGroups/name=Aged%20%2865%2B%20years%29
age groups: http://umcgresearchdatacatalogue.nl/CatalogueOntologies/api/rdf/AgeGroups/name=Middle-aged%20%2845-64%20years%29
age groups: http://umcgresearchdatacatalogue.nl/CatalogueOntologies/api/rdf/AgeGroups/name=Adult%20%2818%2B%20years%29
age groups: http://umcgresearchdatacatalogue.nl/CatalogueOntologies/api/rdf/AgeGroups/name=Young%20adult%20%2818-24%20years%29
age groups: http://umcgresearchdatacatalogue.nl/CatalogueOntologies/api/rdf/AgeGroups/name=Adult%20%2825-44%20years%29
age groups: http://umcgresearchdatacatalogue.nl/CatalogueOntologies/api/rdf/AgeGroups/name=Aged%20%2865-79%20years%29
number of participants: 500
areas of information: http://umcgresearchdatacatalogue.nl/CatalogueOntologies/api/rdf/AreasOfInformationCohorts/name=Personal%20hygiene
areas of information: http://umcgresearchdatacatalogue.nl/CatalogueOntologies/api/rdf/AreasOfInformationCohorts/name=Physical%20activity
areas of information: http://umcgresearchdatacatalogue.nl/CatalogueOntologies/api/rdf/AreasOfInformationCohorts/name=Leisure%20activities
areas of information: http://umcgresearchdatacatalogue.nl/CatalogueOntologies/api/rdf/AreasOfInformationCohorts/name=Transportation
areas of information: http://umcgresearchdatacatalogue.nl/CatalogueOntologies/api/rdf/AreasOfInformationCohorts/name=Breastfeeding
areas of information: http://umcgresearchdatacatalogue.nl/CatalogueOntologies/api/rdf/AreasOfInformationCohorts/name=Sleep
areas of information: http://umcgresearchdatacatalogue.nl/CatalogueOntologies/api/rdf/AreasOfInformationCohorts/name=Sexual%20behaviours%20and%20orientation
areas of information: http://umcgresearchdatacatalogue.nl/CatalogueOntologies/api/rdf/AreasOfInformationCohorts/name=Tobacco
areas of information: http://umcgresearchdatacatalogue.nl/CatalogueOntologies/api/rdf/AreasOfInformationCohorts/name=Other%20and%20unspecified%20lifestyle%20information
areas of information: http://umcgresearchdatacatalogue.nl/CatalogueOntologies/api/rdf/AreasOfInformationCohorts/name=Alcohol
areas of information: http://umcgresearchdatacatalogue.nl/CatalogueOntologies/api/rdf/AreasOfInformationCohorts/name=Misbehaviour%20and%20criminality
areas of information: http://umcgresearchdatacatalogue.nl/CatalogueOntologies/api/rdf/AreasOfInformationCohorts/name=Technological%20devices
areas of information: http://umcgresearchdatacatalogue.nl/CatalogueOntologies/api/rdf/AreasOfInformationCohorts/name=Lifestyle%20and%20behaviours
areas of information: http://umcgresearchdatacatalogue.nl/CatalogueOntologies/api/rdf/AreasOfInformationCohorts/name=Nutrition
areas of information: http://umcgresearchdatacatalogue.nl/CatalogueOntologies/api/rdf/AreasOfInformationCohorts/name=Drugs
data categories: http://umcgresearchdatacatalogue.nl/CatalogueOntologies/api/rdf/DataCategories/name=Survey%20data
standardized tools: http://umcgresearchdatacatalogue.nl/CatalogueOntologies/api/rdf/StandardizedTools/name=Groningen%20IBD%20Nutritional%20Questionnaires
contact point: PSI IBD Kim Sloot
publisher: PSI IBD UMCG
creator: PSI IBD ICC
creator: PSI IBD UMCG
creator: PSI IBD HealthRI
theme: http://umcgresearchdatacatalogue.nl/CatalogueOntologies/api/rdf/Themes/name=Health
theme: HEAL
access rights: http://umcgresearchdatacatalogue.nl/CatalogueOntologies/api/rdf/AccessRights/name=Non%20public
access rights: NON PUBLIC
applicable legislation: http://umcgresearchdatacatalogue.nl/CatalogueOntologies/api/rdf/Legislations/name=Data%20Governance%20Act
applicable legislation: oj
mg_draft: false
mg_insertedOn: 2026-05-13T12:02:11
mg_updatedOn: 2026-05-13T12:02:11

UMCG MOLGENIS support
type: Contacts
type: Observation
type: Kind
type: Individual
endpoint URL: catalogue_rdf
data set: Contacts
resource: UMCG
first name: MOLGENIS
family name: support
last name: support
name: MOLGENIS support
has name: MOLGENIS support
fn: MOLGENIS support
display name: MOLGENIS support
mg_insertedOn: 2026-05-13T12:02:11
mg_updatedOn: 2026-05-13T12:02:11

LIFELINES_NEXT Jackie Dekens
type: Contacts
type: Observation
type: Kind
type: Individual
endpoint URL: catalogue_rdf
data set: Contacts
resource: LIFELINES_NEXT
first name: Jackie
family name: Dekens
last name: Dekens
name: Jackie Dekens
has name: Jackie Dekens
fn: Jackie Dekens
display name: Jackie Dekens
initials: J.A.M.
title: http://umcgresearchdatacatalogue.nl/CatalogueOntologies/api/rdf/Titles/name=drs.
organization: LIFELINES_NEXT UMCG
organisation: LIFELINES_NEXT UMCG
orcid: 0000-0002-9684-9118
expertise: Steering committee LLNEXT
mg_insertedOn: 2026-05-13T12:02:11
mg_updatedOn: 2026-05-13T12:02:11

LIFELINES_NEXT Gerard Koppelman
type: Contacts
type: Observation
type: Kind
type: Individual
endpoint URL: catalogue_rdf
data set: Contacts
resource: LIFELINES_NEXT
first name: Gerard
family name: Koppelman
last name: Koppelman
name: Gerard Koppelman
has name: Gerard Koppelman
fn: Gerard Koppelman
display name: Gerard Koppelman
initials: G.H.
title: http://umcgresearchdatacatalogue.nl/CatalogueOntologies/api/rdf/Titles/name=prof.%20dr.
organization: LIFELINES_NEXT UMCG
organisation: LIFELINES_NEXT UMCG
orcid: 0000-0001-8567-3252
expertise: Steering committee LLNEXT
mg_insertedOn: 2026-05-13T12:02:11
mg_updatedOn: 2026-05-13T12:02:11

LIFELINES_NEXT Alexandra Zhernakova
type: Contacts
type: Observation
type: Kind
type: Individual
endpoint URL: catalogue_rdf
data set: Contacts
resource: LIFELINES_NEXT
role: http://umcgresearchdatacatalogue.nl/CatalogueOntologies/api/rdf/ContributionTypes/name=Principal%20Investigator
has role: http://umcgresearchdatacatalogue.nl/CatalogueOntologies/api/rdf/ContributionTypes/name=Principal%20Investigator
first name: Alexandra
family name: Zhernakova
last name: Zhernakova
name: Alexandra Zhernakova
has name: Alexandra Zhernakova
fn: Alexandra Zhernakova
display name: Alexandra Zhernakova
initials: A
title: http://umcgresearchdatacatalogue.nl/CatalogueOntologies/api/rdf/Titles/name=prof.%20dr.
organization: LIFELINES_NEXT UMCG
organisation: LIFELINES_NEXT UMCG
orcid: 0000-0002-4574-0841
expertise: PI LLNEXT
mg_insertedOn: 2026-05-13T12:02:11
mg_updatedOn: 2026-05-13T12:02:11

LIFELINES_NEXT Sanne Gordijn
type: Contacts
type: Observation
type: Kind
type: Individual
endpoint URL: catalogue_rdf
data set: Contacts
resource: LIFELINES_NEXT
first name: Sanne
family name: Gordijn
last name: Gordijn
name: Sanne Gordijn
has name: Sanne Gordijn
fn: Sanne Gordijn
display name: Sanne Gordijn
initials: S.J.
title: http://umcgresearchdatacatalogue.nl/CatalogueOntologies/api/rdf/Titles/name=dr.
organization: LIFELINES_NEXT UMCG
organisation: LIFELINES_NEXT UMCG
orcid: 0000-0003-3915-8609
url: https://linkedin.com/in/sanne-gordijn-17a1422a/
workplace homepage: https://linkedin.com/in/sanne-gordijn-17a1422a/
has URL: https://linkedin.com/in/sanne-gordijn-17a1422a/
homepage: https://linkedin.com/in/sanne-gordijn-17a1422a/
expertise: Steering committee LLNEXT
mg_draft: false
mg_insertedOn: 2026-05-13T12:02:11
mg_updatedOn: 2026-05-13T12:02:11

LIFELINES_NEXT Lifelines NEXT Contact
type: Contacts
type: Observation
type: Kind
type: Individual
endpoint URL: catalogue_rdf
data set: Contacts
resource: LIFELINES_NEXT
role: http://umcgresearchdatacatalogue.nl/CatalogueOntologies/api/rdf/ContributionTypes/name=Primary%20contact
has role: http://umcgresearchdatacatalogue.nl/CatalogueOntologies/api/rdf/ContributionTypes/name=Primary%20contact
first name: Lifelines NEXT
family name: Contact
last name: Contact
name: Lifelines NEXT Contact
has name: Lifelines NEXT Contact
fn: Lifelines NEXT Contact
display name: Lifelines NEXT Contact
mg_draft: false
mg_insertedOn: 2026-05-13T12:02:11
mg_updatedOn: 2026-05-13T12:02:11

LIFELINES_NEXT Soesma Jankipersadsing
type: Contacts
type: Observation
type: Kind
type: Individual
endpoint URL: catalogue_rdf
data set: Contacts
resource: LIFELINES_NEXT
first name: Soesma
family name: Jankipersadsing
last name: Jankipersadsing
name: Soesma Jankipersadsing
has name: Soesma Jankipersadsing
fn: Soesma Jankipersadsing
display name: Soesma Jankipersadsing
initials: SA
title: http://umcgresearchdatacatalogue.nl/CatalogueOntologies/api/rdf/Titles/name=drs.
organization: LIFELINES_NEXT UMCG
organisation: LIFELINES_NEXT UMCG
orcid: 0000-0001-9225-9236
url: https://linkedin.com/in/soesma-jankipersadsing-151a0013/
workplace homepage: https://linkedin.com/in/soesma-jankipersadsing-151a0013/
has URL: https://linkedin.com/in/soesma-jankipersadsing-151a0013/
homepage: https://linkedin.com/in/soesma-jankipersadsing-151a0013/
expertise: Project manager LLNEXT
mg_draft: false
mg_insertedOn: 2026-05-13T12:02:11
mg_updatedOn: 2026-05-13T12:02:11

LIFELINES_NEXT Menno Reijneveld
type: Contacts
type: Observation
type: Kind
type: Individual
endpoint URL: catalogue_rdf
data set: Contacts
resource: LIFELINES_NEXT
first name: Menno
family name: Reijneveld
last name: Reijneveld
name: Menno Reijneveld
has name: Menno Reijneveld
fn: Menno Reijneveld
display name: Menno Reijneveld
initials: S.A.
title: http://umcgresearchdatacatalogue.nl/CatalogueOntologies/api/rdf/Titles/name=prof.%20dr.
organization: LIFELINES_NEXT UMCG
organisation: LIFELINES_NEXT UMCG
orcid: 0000-0002-1206-7523
expertise: Steering committee LLNEXT
mg_draft: false
mg_insertedOn: 2026-05-13T12:02:12
mg_updatedOn: 2026-05-13T12:02:12

AHON Manfred Schweiger
type: Contacts
type: Observation
type: Kind
type: Individual
endpoint URL: catalogue_rdf
data set: Contacts
resource: AHON
first name: Manfred
family name: Schweiger
last name: Schweiger
name: Manfred Schweiger
has name: Manfred Schweiger
fn: Manfred Schweiger
display name: Manfred Schweiger
initials: M.M.
organization: AHON UMCG
organisation: AHON UMCG
mg_insertedOn: 2026-05-13T12:02:12
mg_updatedOn: 2026-05-13T12:02:12

AHON Marco Blanker
type: Contacts
type: Observation
type: Kind
type: Individual
endpoint URL: catalogue_rdf
data set: Contacts
resource: AHON
role: http://umcgresearchdatacatalogue.nl/CatalogueOntologies/api/rdf/ContributionTypes/name=Principal%20Investigator
has role: http://umcgresearchdatacatalogue.nl/CatalogueOntologies/api/rdf/ContributionTypes/name=Principal%20Investigator
first name: Marco
family name: Blanker
last name: Blanker
name: Marco Blanker
has name: Marco Blanker
fn: Marco Blanker
display name: Marco Blanker
initials: M.H.
title: http://umcgresearchdatacatalogue.nl/CatalogueOntologies/api/rdf/Titles/name=prof.%20dr.
orcid: 0000-0002-1086-8730
url: https://www.rug.nl/staff/m.h.blanker/
workplace homepage: https://www.rug.nl/staff/m.h.blanker/
has URL: https://www.rug.nl/staff/m.h.blanker/
homepage: https://www.rug.nl/staff/m.h.blanker/
mg_insertedOn: 2026-05-13T12:02:12
mg_updatedOn: 2026-05-13T12:02:12

AHON Maarten Brilman
type: Contacts
type: Observation
type: Kind
type: Individual
endpoint URL: catalogue_rdf
data set: Contacts
resource: AHON
first name: Maarten
family name: Brilman
last name: Brilman
name: Maarten Brilman
has name: Maarten Brilman
fn: Maarten Brilman
display name: Maarten Brilman
initials: M.F.
orcid: https://orcid.org/0000-0002-6108-9673
mg_draft: false
mg_insertedOn: 2026-05-13T12:02:12
mg_updatedOn: 2026-05-13T12:02:12

AHON Lucas Assen
type: Contacts
type: Observation
type: Kind
type: Individual
endpoint URL: catalogue_rdf
data set: Contacts
resource: AHON
role: http://umcgresearchdatacatalogue.nl/CatalogueOntologies/api/rdf/ContributionTypes/name=Data%20manager
has role: http://umcgresearchdatacatalogue.nl/CatalogueOntologies/api/rdf/ContributionTypes/name=Data%20manager
first name: Lucas
family name: Assen
last name: Assen
name: Lucas Assen
has name: Lucas Assen
fn: Lucas Assen
display name: Lucas Assen
prefix: van
initials: L.B.
title: http://umcgresearchdatacatalogue.nl/CatalogueOntologies/api/rdf/Titles/name=drs.
organization: AHON UMCG
organisation: AHON UMCG
mg_draft: false
mg_insertedOn: 2026-05-13T12:02:12
mg_updatedOn: 2026-05-13T12:02:12

AHON Gerlijn Nolle
type: Contacts
type: Observation
type: Kind
type: Individual
endpoint URL: catalogue_rdf
data set: Contacts
resource: AHON
role: http://umcgresearchdatacatalogue.nl/CatalogueOntologies/api/rdf/ContributionTypes/name=Data%20manager
has role: http://umcgresearchdatacatalogue.nl/CatalogueOntologies/api/rdf/ContributionTypes/name=Data%20manager
first name: Gerlijn
family name: Nolle
last name: Nolle
name: Gerlijn Nolle
has name: Gerlijn Nolle
fn: Gerlijn Nolle
display name: Gerlijn Nolle
initials: G.
title: http://umcgresearchdatacatalogue.nl/CatalogueOntologies/api/rdf/Titles/name=drs.
organization: AHON UMCG
organisation: AHON UMCG
mg_draft: false
mg_insertedOn: 2026-05-13T12:02:12
mg_updatedOn: 2026-05-13T12:02:12

AHON AHON Contact
type: Contacts
type: Observation
type: Kind
type: Individual
endpoint URL: catalogue_rdf
data set: Contacts
resource: AHON
role: http://umcgresearchdatacatalogue.nl/CatalogueOntologies/api/rdf/ContributionTypes/name=Primary%20contact
has role: http://umcgresearchdatacatalogue.nl/CatalogueOntologies/api/rdf/ContributionTypes/name=Primary%20contact
first name: AHON
family name: Contact
last name: Contact
name: AHON Contact
has name: AHON Contact
fn: AHON Contact
display name: AHON Contact
mg_draft: false
mg_insertedOn: 2026-05-13T12:02:12
mg_updatedOn: 2026-05-13T12:02:12

AHON Karina Sulim
type: Contacts
type: Observation
type: Kind
type: Individual
endpoint URL: catalogue_rdf
data set: Contacts
resource: AHON
role: http://umcgresearchdatacatalogue.nl/CatalogueOntologies/api/rdf/ContributionTypes/name=Data%20manager
has role: http://umcgresearchdatacatalogue.nl/CatalogueOntologies/api/rdf/ContributionTypes/name=Data%20manager
first name: Karina
family name: Sulim
last name: Sulim
name: Karina Sulim
has name: Karina Sulim
fn: Karina Sulim
display name: Karina Sulim
initials: K.
organization: AHON UMCG
organisation: AHON UMCG
orcid: 0009-0008-8871-6498
mg_draft: false
mg_insertedOn: 2026-05-13T12:02:12
mg_updatedOn: 2026-05-13T12:02:12

AHON Nynke Schouwenaars
type: Contacts
type: Observation
type: Kind
type: Individual
endpoint URL: catalogue_rdf
data set: Contacts
resource: AHON
first name: Nynke
family name: Schouwenaars
last name: Schouwenaars
name: Nynke Schouwenaars
has name: Nynke Schouwenaars
fn: Nynke Schouwenaars
display name: Nynke Schouwenaars
initials: N.T.
organization: AHON UMCG
organisation: AHON UMCG
orcid: 0009-0007-1784-8031
url: https://www.rug.nl/staff/n.t.schouenaars/
workplace homepage: https://www.rug.nl/staff/n.t.schouenaars/
has URL: https://www.rug.nl/staff/n.t.schouenaars/
homepage: https://www.rug.nl/staff/n.t.schouenaars/
mg_draft: false
mg_insertedOn: 2026-05-13T12:02:12
mg_updatedOn: 2026-05-13T12:02:12

OncoLifeS Janny Nagel
type: Contacts
type: Observation
type: Kind
type: Individual
endpoint URL: catalogue_rdf
data set: Contacts
resource: OncoLifeS
role: http://umcgresearchdatacatalogue.nl/CatalogueOntologies/api/rdf/ContributionTypes/name=Primary%20contact
has role: http://umcgresearchdatacatalogue.nl/CatalogueOntologies/api/rdf/ContributionTypes/name=Primary%20contact
first name: Janny
family name: Nagel
last name: Nagel
name: Janny Nagel
has name: Janny Nagel
fn: Janny Nagel
display name: Janny Nagel
organization: OncoLifeS UMCG
organisation: OncoLifeS UMCG
mg_insertedOn: 2026-05-13T12:02:12
mg_updatedOn: 2026-05-13T12:02:12

OncoLifeS Truuske Bock
type: Contacts
type: Observation
type: Kind
type: Individual
endpoint URL: catalogue_rdf
data set: Contacts
resource: OncoLifeS
role: http://umcgresearchdatacatalogue.nl/CatalogueOntologies/api/rdf/ContributionTypes/name=Principal%20Investigator
has role: http://umcgresearchdatacatalogue.nl/CatalogueOntologies/api/rdf/ContributionTypes/name=Principal%20Investigator
first name: Truuske
family name: Bock
last name: Bock
name: Truuske Bock
has name: Truuske Bock
fn: Truuske Bock
display name: Truuske Bock
prefix: de
initials: G.H.
title: http://umcgresearchdatacatalogue.nl/CatalogueOntologies/api/rdf/Titles/name=prof.%20dr.
organization: OncoLifeS UMCG
organisation: OncoLifeS UMCG
orcid: https://orcid.org/0000-0003-3104-4471
mg_draft: false
mg_insertedOn: 2026-05-13T12:02:12
mg_updatedOn: 2026-05-13T12:02:12

AcuteLines Hjalmar Bouma
type: Contacts
type: Observation
type: Kind
type: Individual
endpoint URL: catalogue_rdf
data set: Contacts
resource: AcuteLines
role: http://umcgresearchdatacatalogue.nl/CatalogueOntologies/api/rdf/ContributionTypes/name=Primary%20contact
role: http://umcgresearchdatacatalogue.nl/CatalogueOntologies/api/rdf/ContributionTypes/name=Principal%20Investigator
has role: http://umcgresearchdatacatalogue.nl/CatalogueOntologies/api/rdf/ContributionTypes/name=Primary%20contact
has role: http://umcgresearchdatacatalogue.nl/CatalogueOntologies/api/rdf/ContributionTypes/name=Principal%20Investigator
first name: Hjalmar
family name: Bouma
last name: Bouma
name: Hjalmar Bouma
has name: Hjalmar Bouma
fn: Hjalmar Bouma
display name: Hjalmar Bouma
initials: H.R.
title: http://umcgresearchdatacatalogue.nl/CatalogueOntologies/api/rdf/Titles/name=dr.
orcid: https://orcid.org/0000-0003-1032-321X
mg_draft: false
mg_insertedOn: 2026-05-13T12:02:12
mg_updatedOn: 2026-05-13T12:02:12

EGAS00001000644 Gert-Jan van de Geijn
type: Contacts
type: Observation
type: Kind
type: Individual
endpoint URL: catalogue_rdf
data set: Contacts
resource: EGAS00001000644
role: http://umcgresearchdatacatalogue.nl/CatalogueOntologies/api/rdf/ContributionTypes/name=Primary%20contact
has role: http://umcgresearchdatacatalogue.nl/CatalogueOntologies/api/rdf/ContributionTypes/name=Primary%20contact
first name: Gert-Jan
family name: van de Geijn
last name: van de Geijn
name: Gert-Jan van de Geijn
has name: Gert-Jan van de Geijn
fn: Gert-Jan van de Geijn
display name: Gert-Jan van de Geijn
mg_draft: false
mg_insertedOn: 2026-05-13T12:02:12
mg_updatedOn: 2026-05-13T12:02:12

UMCG Cohort and Biobank Coordination Hub
type: Contacts
type: Observation
type: Kind
type: Individual
endpoint URL: catalogue_rdf
data set: Contacts
resource: UMCG
first name: Cohort and Biobank
family name: Coordination Hub
last name: Coordination Hub
name: Cohort and Biobank Coordination Hub
has name: Cohort and Biobank Coordination Hub
fn: Cohort and Biobank Coordination Hub
display name: Cohort and Biobank Coordination Hub
mg_draft: false
mg_insertedOn: 2026-05-13T12:02:12
mg_updatedOn: 2026-05-13T12:02:12

EGAS00001006999 Lifelines Data Management
type: Contacts
type: Observation
type: Kind
type: Individual
endpoint URL: catalogue_rdf
data set: Contacts
resource: EGAS00001006999
first name: Lifelines
family name: Data Management
last name: Data Management
name: Lifelines Data Management
has name: Lifelines Data Management
fn: Lifelines Data Management
display name: Lifelines Data Management
mg_draft: false
mg_insertedOn: 2026-05-13T12:02:12
mg_updatedOn: 2026-05-13T12:02:12

EGAS00001002169 Gerard Koppelman
type: Contacts
type: Observation
type: Kind
type: Individual
endpoint URL: catalogue_rdf
data set: Contacts
resource: EGAS00001002169
role: http://umcgresearchdatacatalogue.nl/CatalogueOntologies/api/rdf/ContributionTypes/name=Principal%20Investigator
has role: http://umcgresearchdatacatalogue.nl/CatalogueOntologies/api/rdf/ContributionTypes/name=Principal%20Investigator
first name: Gerard
family name: Koppelman
last name: Koppelman
name: Gerard Koppelman
has name: Gerard Koppelman
fn: Gerard Koppelman
display name: Gerard Koppelman
mg_draft: false
mg_insertedOn: 2026-05-13T12:02:12
mg_updatedOn: 2026-05-13T12:02:12

EGAS00001002560 Monique van der Wijst
type: Contacts
type: Observation
type: Kind
type: Individual
endpoint URL: catalogue_rdf
data set: Contacts
resource: EGAS00001002560
role: http://umcgresearchdatacatalogue.nl/CatalogueOntologies/api/rdf/ContributionTypes/name=Principal%20Investigator
has role: http://umcgresearchdatacatalogue.nl/CatalogueOntologies/api/rdf/ContributionTypes/name=Principal%20Investigator
first name: Monique van der
family name: Wijst
last name: Wijst
name: Monique van der Wijst
has name: Monique van der Wijst
fn: Monique van der Wijst
display name: Monique van der Wijst
mg_draft: false
mg_insertedOn: 2026-05-13T12:02:12
mg_updatedOn: 2026-05-13T12:02:12

EGAS00001003735 Maarten van den Berge
type: Contacts
type: Observation
type: Kind
type: Individual
endpoint URL: catalogue_rdf
data set: Contacts
resource: EGAS00001003735
role: http://umcgresearchdatacatalogue.nl/CatalogueOntologies/api/rdf/ContributionTypes/name=Principal%20Investigator
has role: http://umcgresearchdatacatalogue.nl/CatalogueOntologies/api/rdf/ContributionTypes/name=Principal%20Investigator
first name: Maarten van den
family name: Berge
last name: Berge
name: Maarten van den Berge
has name: Maarten van den Berge
fn: Maarten van den Berge
display name: Maarten van den Berge
mg_draft: false
mg_insertedOn: 2026-05-13T12:02:12
mg_updatedOn: 2026-05-13T12:02:12

EGAS00001003739 Maarten van den Berge
type: Contacts
type: Observation
type: Kind
type: Individual
endpoint URL: catalogue_rdf
data set: Contacts
resource: EGAS00001003739
role: http://umcgresearchdatacatalogue.nl/CatalogueOntologies/api/rdf/ContributionTypes/name=Principal%20Investigator
has role: http://umcgresearchdatacatalogue.nl/CatalogueOntologies/api/rdf/ContributionTypes/name=Principal%20Investigator
first name: Maarten van den
family name: Berge
last name: Berge
name: Maarten van den Berge
has name: Maarten van den Berge
fn: Maarten van den Berge
display name: Maarten van den Berge
mg_draft: false
mg_insertedOn: 2026-05-13T12:02:12
mg_updatedOn: 2026-05-13T12:02:12

EGAS00001003805 Vinod Kumar
type: Contacts
type: Observation
type: Kind
type: Individual
endpoint URL: catalogue_rdf
data set: Contacts
resource: EGAS00001003805
first name: Vinod
family name: Kumar
last name: Kumar
name: Vinod Kumar
has name: Vinod Kumar
fn: Vinod Kumar
display name: Vinod Kumar
mg_insertedOn: 2026-05-13T12:02:12
mg_updatedOn: 2026-05-13T12:02:12

EGAS00001003805 Iris Jonker
type: Contacts
type: Observation
type: Kind
type: Individual
endpoint URL: catalogue_rdf
data set: Contacts
resource: EGAS00001003805
role: http://umcgresearchdatacatalogue.nl/CatalogueOntologies/api/rdf/ContributionTypes/name=Principal%20Investigator
has role: http://umcgresearchdatacatalogue.nl/CatalogueOntologies/api/rdf/ContributionTypes/name=Principal%20Investigator
first name: Iris
family name: Jonker
last name: Jonker
name: Iris Jonker
has name: Iris Jonker
fn: Iris Jonker
display name: Iris Jonker
title: http://umcgresearchdatacatalogue.nl/CatalogueOntologies/api/rdf/Titles/name=dr.
mg_draft: false
mg_insertedOn: 2026-05-13T12:02:12
mg_updatedOn: 2026-05-13T12:02:12

EGAS00001003805 Sebo Withoff
type: Contacts
type: Observation
type: Kind
type: Individual
endpoint URL: catalogue_rdf
data set: Contacts
resource: EGAS00001003805
first name: Sebo
family name: Withoff
last name: Withoff
name: Sebo Withoff
has name: Sebo Withoff
fn: Sebo Withoff
display name: Sebo Withoff
title: http://umcgresearchdatacatalogue.nl/CatalogueOntologies/api/rdf/Titles/name=dr.
mg_draft: false
mg_insertedOn: 2026-05-13T12:02:12
mg_updatedOn: 2026-05-13T12:02:12

EGAS00001004766 Judith M Vonk
type: Contacts
type: Observation
type: Kind
type: Individual
endpoint URL: catalogue_rdf
data set: Contacts
resource: EGAS00001004766
first name: Judith M
family name: Vonk
last name: Vonk
name: Judith M Vonk
has name: Judith M Vonk
fn: Judith M Vonk
display name: Judith M Vonk
mg_insertedOn: 2026-05-13T12:02:12
mg_updatedOn: 2026-05-13T12:02:12

EGAS00001004766 Gerard Koppelman
type: Contacts
type: Observation
type: Kind
type: Individual
endpoint URL: catalogue_rdf
data set: Contacts
resource: EGAS00001004766
role: http://umcgresearchdatacatalogue.nl/CatalogueOntologies/api/rdf/ContributionTypes/name=Principal%20Investigator
has role: http://umcgresearchdatacatalogue.nl/CatalogueOntologies/api/rdf/ContributionTypes/name=Principal%20Investigator
first name: Gerard
family name: Koppelman
last name: Koppelman
name: Gerard Koppelman
has name: Gerard Koppelman
fn: Gerard Koppelman
display name: Gerard Koppelman
mg_draft: false
mg_insertedOn: 2026-05-13T12:02:12
mg_updatedOn: 2026-05-13T12:02:12

EGAS00001005027 Rinse Weersma
type: Contacts
type: Observation
type: Kind
type: Individual
endpoint URL: catalogue_rdf
data set: Contacts
resource: EGAS00001005027
first name: Rinse
family name: Weersma
last name: Weersma
name: Rinse Weersma
has name: Rinse Weersma
fn: Rinse Weersma
display name: Rinse Weersma
mg_insertedOn: 2026-05-13T12:02:12
mg_updatedOn: 2026-05-13T12:02:12

EGAS00001005027 Ranko Gacesa
type: Contacts
type: Observation
type: Kind
type: Individual
endpoint URL: catalogue_rdf
data set: Contacts
resource: EGAS00001005027
first name: Ranko
family name: Gacesa
last name: Gacesa
name: Ranko Gacesa
has name: Ranko Gacesa
fn: Ranko Gacesa
display name: Ranko Gacesa
mg_insertedOn: 2026-05-13T12:02:12
mg_updatedOn: 2026-05-13T12:02:12

EGAS00001005027 Sasha Zhernakova
type: Contacts
type: Observation
type: Kind
type: Individual
endpoint URL: catalogue_rdf
data set: Contacts
resource: EGAS00001005027
first name: Sasha
family name: Zhernakova
last name: Zhernakova
name: Sasha Zhernakova
has name: Sasha Zhernakova
fn: Sasha Zhernakova
display name: Sasha Zhernakova
mg_insertedOn: 2026-05-13T12:02:12
mg_updatedOn: 2026-05-13T12:02:12

EGAS00001005027 Lifelines Data Management
type: Contacts
type: Observation
type: Kind
type: Individual
endpoint URL: catalogue_rdf
data set: Contacts
resource: EGAS00001005027
role: http://umcgresearchdatacatalogue.nl/CatalogueOntologies/api/rdf/ContributionTypes/name=Primary%20contact
has role: http://umcgresearchdatacatalogue.nl/CatalogueOntologies/api/rdf/ContributionTypes/name=Primary%20contact
first name: Lifelines
family name: Data Management
last name: Data Management
name: Lifelines Data Management
has name: Lifelines Data Management
fn: Lifelines Data Management
display name: Lifelines Data Management
mg_draft: false
mg_insertedOn: 2026-05-13T12:02:12
mg_updatedOn: 2026-05-13T12:02:12

EGAS00001005189 Judith M Vonk
type: Contacts
type: Observation
type: Kind
type: Individual
endpoint URL: catalogue_rdf
data set: Contacts
resource: EGAS00001005189
first name: Judith M
family name: Vonk
last name: Vonk
name: Judith M Vonk
has name: Judith M Vonk
fn: Judith M Vonk
display name: Judith M Vonk
mg_insertedOn: 2026-05-13T12:02:12
mg_updatedOn: 2026-05-13T12:02:12

EGAS00001005189 Gerard Koppelman
type: Contacts
type: Observation
type: Kind
type: Individual
endpoint URL: catalogue_rdf
data set: Contacts
resource: EGAS00001005189
role: http://umcgresearchdatacatalogue.nl/CatalogueOntologies/api/rdf/ContributionTypes/name=Principal%20Investigator
has role: http://umcgresearchdatacatalogue.nl/CatalogueOntologies/api/rdf/ContributionTypes/name=Principal%20Investigator
first name: Gerard
family name: Koppelman
last name: Koppelman
name: Gerard Koppelman
has name: Gerard Koppelman
fn: Gerard Koppelman
display name: Gerard Koppelman
mg_draft: false
mg_insertedOn: 2026-05-13T12:02:12
mg_updatedOn: 2026-05-13T12:02:12

EGAS00001005225 Sasha Zhernakova
type: Contacts
type: Observation
type: Kind
type: Individual
endpoint URL: catalogue_rdf
data set: Contacts
resource: EGAS00001005225
role: http://umcgresearchdatacatalogue.nl/CatalogueOntologies/api/rdf/ContributionTypes/name=Principal%20Investigator
has role: http://umcgresearchdatacatalogue.nl/CatalogueOntologies/api/rdf/ContributionTypes/name=Principal%20Investigator
first name: Sasha
family name: Zhernakova
last name: Zhernakova
name: Sasha Zhernakova
has name: Sasha Zhernakova
fn: Sasha Zhernakova
display name: Sasha Zhernakova
mg_draft: false
mg_insertedOn: 2026-05-13T12:02:12
mg_updatedOn: 2026-05-13T12:02:12

EGAS00001005376 Monique van der Wijst
type: Contacts
type: Observation
type: Kind
type: Individual
endpoint URL: catalogue_rdf
data set: Contacts
resource: EGAS00001005376
role: http://umcgresearchdatacatalogue.nl/CatalogueOntologies/api/rdf/ContributionTypes/name=Principal%20Investigator
has role: http://umcgresearchdatacatalogue.nl/CatalogueOntologies/api/rdf/ContributionTypes/name=Principal%20Investigator
first name: Monique van der
family name: Wijst
last name: Wijst
name: Monique van der Wijst
has name: Monique van der Wijst
fn: Monique van der Wijst
display name: Monique van der Wijst
mg_draft: false
mg_insertedOn: 2026-05-13T12:02:12
mg_updatedOn: 2026-05-13T12:02:12

EGAS00001006258 TransplantLines investigators
type: Contacts
type: Observation
type: Kind
type: Individual
endpoint URL: catalogue_rdf
data set: Contacts
resource: EGAS00001006258
role: http://umcgresearchdatacatalogue.nl/CatalogueOntologies/api/rdf/ContributionTypes/name=Principal%20Investigator
has role: http://umcgresearchdatacatalogue.nl/CatalogueOntologies/api/rdf/ContributionTypes/name=Principal%20Investigator
first name: TransplantLines
family name: investigators
last name: investigators
name: TransplantLines investigators
has name: TransplantLines investigators
fn: TransplantLines investigators
display name: TransplantLines investigators
mg_insertedOn: 2026-05-13T12:02:12
mg_updatedOn: 2026-05-13T12:02:12

EGAS00001006347 Kajsa Paulsson
type: Contacts
type: Observation
type: Kind
type: Individual
endpoint URL: catalogue_rdf
data set: Contacts
resource: EGAS00001006347
role: http://umcgresearchdatacatalogue.nl/CatalogueOntologies/api/rdf/ContributionTypes/name=Principal%20Investigator
has role: http://umcgresearchdatacatalogue.nl/CatalogueOntologies/api/rdf/ContributionTypes/name=Principal%20Investigator
first name: Kajsa
family name: Paulsson
last name: Paulsson
name: Kajsa Paulsson
has name: Kajsa Paulsson
fn: Kajsa Paulsson
display name: Kajsa Paulsson
mg_draft: false
mg_insertedOn: 2026-05-13T12:02:12
mg_updatedOn: 2026-05-13T12:02:12

EGAS00001006657 Maarten van den Berge
type: Contacts
type: Observation
type: Kind
type: Individual
endpoint URL: catalogue_rdf
data set: Contacts
resource: EGAS00001006657
first name: Maarten van den
family name: Berge
last name: Berge
name: Maarten van den Berge
has name: Maarten van den Berge
fn: Maarten van den Berge
display name: Maarten van den Berge
mg_insertedOn: 2026-05-13T12:02:12
mg_updatedOn: 2026-05-13T12:02:12

EGAS00001006657 Martijn Nawijn
type: Contacts
type: Observation
type: Kind
type: Individual
endpoint URL: catalogue_rdf
data set: Contacts
resource: EGAS00001006657
role: http://umcgresearchdatacatalogue.nl/CatalogueOntologies/api/rdf/ContributionTypes/name=Principal%20Investigator
has role: http://umcgresearchdatacatalogue.nl/CatalogueOntologies/api/rdf/ContributionTypes/name=Principal%20Investigator
first name: Martijn
family name: Nawijn
last name: Nawijn
name: Martijn Nawijn
has name: Martijn Nawijn
fn: Martijn Nawijn
display name: Martijn Nawijn
mg_draft: false
mg_insertedOn: 2026-05-13T12:02:12
mg_updatedOn: 2026-05-13T12:02:12

EGAS00001007021 Monique van der Wijst
type: Contacts
type: Observation
type: Kind
type: Individual
endpoint URL: catalogue_rdf
data set: Contacts
resource: EGAS00001007021
role: http://umcgresearchdatacatalogue.nl/CatalogueOntologies/api/rdf/ContributionTypes/name=Principal%20Investigator
has role: http://umcgresearchdatacatalogue.nl/CatalogueOntologies/api/rdf/ContributionTypes/name=Principal%20Investigator
first name: Monique van der
family name: Wijst
last name: Wijst
name: Monique van der Wijst
has name: Monique van der Wijst
fn: Monique van der Wijst
display name: Monique van der Wijst
mg_draft: false
mg_insertedOn: 2026-05-13T12:02:12
mg_updatedOn: 2026-05-13T12:02:12

EGAS00001007054 Rinse Weersma
type: Contacts
type: Observation
type: Kind
type: Individual
endpoint URL: catalogue_rdf
data set: Contacts
resource: EGAS00001007054
first name: Rinse
family name: Weersma
last name: Weersma
name: Rinse Weersma
has name: Rinse Weersma
fn: Rinse Weersma
display name: Rinse Weersma
mg_insertedOn: 2026-05-13T12:02:12
mg_updatedOn: 2026-05-13T12:02:12

EGAS00001007054 Wieke Holwerda Holwerda
type: Contacts
type: Observation
type: Kind
type: Individual
endpoint URL: catalogue_rdf
data set: Contacts
resource: EGAS00001007054
first name: Wieke Holwerda
family name: Holwerda
last name: Holwerda
name: Wieke Holwerda Holwerda
has name: Wieke Holwerda Holwerda
fn: Wieke Holwerda Holwerda
display name: Wieke Holwerda Holwerda
mg_insertedOn: 2026-05-13T12:02:12
mg_updatedOn: 2026-05-13T12:02:12

EGAS00001007054 Inge Schuiling
type: Contacts
type: Observation
type: Kind
type: Individual
endpoint URL: catalogue_rdf
data set: Contacts
resource: EGAS00001007054
role: http://umcgresearchdatacatalogue.nl/CatalogueOntologies/api/rdf/ContributionTypes/name=Principal%20Investigator
has role: http://umcgresearchdatacatalogue.nl/CatalogueOntologies/api/rdf/ContributionTypes/name=Principal%20Investigator
first name: Inge
family name: Schuiling
last name: Schuiling
name: Inge Schuiling
has name: Inge Schuiling
fn: Inge Schuiling
display name: Inge Schuiling
mg_draft: false
mg_insertedOn: 2026-05-13T12:02:12
mg_updatedOn: 2026-05-13T12:02:12

EGAS00001007450 Martijn Nawijn
type: Contacts
type: Observation
type: Kind
type: Individual
endpoint URL: catalogue_rdf
data set: Contacts
resource: EGAS00001007450
role: http://umcgresearchdatacatalogue.nl/CatalogueOntologies/api/rdf/ContributionTypes/name=Principal%20Investigator
has role: http://umcgresearchdatacatalogue.nl/CatalogueOntologies/api/rdf/ContributionTypes/name=Principal%20Investigator
first name: Martijn
family name: Nawijn
last name: Nawijn
name: Martijn Nawijn
has name: Martijn Nawijn
fn: Martijn Nawijn
display name: Martijn Nawijn
mg_draft: false
mg_insertedOn: 2026-05-13T12:02:12
mg_updatedOn: 2026-05-13T12:02:12

EGAS00001007571 Trishla Sinha
type: Contacts
type: Observation
type: Kind
type: Individual
endpoint URL: catalogue_rdf
data set: Contacts
resource: EGAS00001007571
first name: Trishla
family name: Sinha
last name: Sinha
name: Trishla Sinha
has name: Trishla Sinha
fn: Trishla Sinha
display name: Trishla Sinha
mg_insertedOn: 2026-05-13T12:02:12
mg_updatedOn: 2026-05-13T12:02:12

EGAS00001007571 Alexander Kurilshikov
type: Contacts
type: Observation
type: Kind
type: Individual
endpoint URL: catalogue_rdf
data set: Contacts
resource: EGAS00001007571
first name: Alexander
family name: Kurilshikov
last name: Kurilshikov
name: Alexander Kurilshikov
has name: Alexander Kurilshikov
fn: Alexander Kurilshikov
display name: Alexander Kurilshikov
mg_insertedOn: 2026-05-13T12:02:12
mg_updatedOn: 2026-05-13T12:02:12

EGAS00001007571 Alexandra Zhernakova
type: Contacts
type: Observation
type: Kind
type: Individual
endpoint URL: catalogue_rdf
data set: Contacts
resource: EGAS00001007571
role: http://umcgresearchdatacatalogue.nl/CatalogueOntologies/api/rdf/ContributionTypes/name=Principal%20Investigator
has role: http://umcgresearchdatacatalogue.nl/CatalogueOntologies/api/rdf/ContributionTypes/name=Principal%20Investigator
first name: Alexandra
family name: Zhernakova
last name: Zhernakova
name: Alexandra Zhernakova
has name: Alexandra Zhernakova
fn: Alexandra Zhernakova
display name: Alexandra Zhernakova
mg_draft: false
mg_insertedOn: 2026-05-13T12:02:12
mg_updatedOn: 2026-05-13T12:02:12

EGAS50000000133 Trishla Sinha
type: Contacts
type: Observation
type: Kind
type: Individual
endpoint URL: catalogue_rdf
data set: Contacts
resource: EGAS50000000133
role: http://umcgresearchdatacatalogue.nl/CatalogueOntologies/api/rdf/ContributionTypes/name=Principal%20Investigator
has role: http://umcgresearchdatacatalogue.nl/CatalogueOntologies/api/rdf/ContributionTypes/name=Principal%20Investigator
first name: Trishla
family name: Sinha
last name: Sinha
name: Trishla Sinha
has name: Trishla Sinha
fn: Trishla Sinha
display name: Trishla Sinha
mg_insertedOn: 2026-05-13T12:02:12
mg_updatedOn: 2026-05-13T12:02:12

EGAS50000000133 Alexander Kurilshikov
type: Contacts
type: Observation
type: Kind
type: Individual
endpoint URL: catalogue_rdf
data set: Contacts
resource: EGAS50000000133
first name: Alexander
family name: Kurilshikov
last name: Kurilshikov
name: Alexander Kurilshikov
has name: Alexander Kurilshikov
fn: Alexander Kurilshikov
display name: Alexander Kurilshikov
mg_insertedOn: 2026-05-13T12:02:12
mg_updatedOn: 2026-05-13T12:02:12

EGAS50000000133 Soesma Jankipersadsing
type: Contacts
type: Observation
type: Kind
type: Individual
endpoint URL: catalogue_rdf
data set: Contacts
resource: EGAS50000000133
role: http://umcgresearchdatacatalogue.nl/CatalogueOntologies/api/rdf/ContributionTypes/name=Principal%20Investigator
has role: http://umcgresearchdatacatalogue.nl/CatalogueOntologies/api/rdf/ContributionTypes/name=Principal%20Investigator
first name: Soesma
family name: Jankipersadsing
last name: Jankipersadsing
name: Soesma Jankipersadsing
has name: Soesma Jankipersadsing
fn: Soesma Jankipersadsing
display name: Soesma Jankipersadsing
mg_insertedOn: 2026-05-13T12:02:12
mg_updatedOn: 2026-05-13T12:02:12

EGAS50000000133 Marshellon Martinus
type: Contacts
type: Observation
type: Kind
type: Individual
endpoint URL: catalogue_rdf
data set: Contacts
resource: EGAS50000000133
first name: Marshellon
family name: Martinus
last name: Martinus
name: Marshellon Martinus
has name: Marshellon Martinus
fn: Marshellon Martinus
display name: Marshellon Martinus
mg_insertedOn: 2026-05-13T12:02:12
mg_updatedOn: 2026-05-13T12:02:12

EGAS50000000133 Alexandra Zhernakova
type: Contacts
type: Observation
type: Kind
type: Individual
endpoint URL: catalogue_rdf
data set: Contacts
resource: EGAS50000000133
role: http://umcgresearchdatacatalogue.nl/CatalogueOntologies/api/rdf/ContributionTypes/name=Principal%20Investigator
has role: http://umcgresearchdatacatalogue.nl/CatalogueOntologies/api/rdf/ContributionTypes/name=Principal%20Investigator
first name: Alexandra
family name: Zhernakova
last name: Zhernakova
name: Alexandra Zhernakova
has name: Alexandra Zhernakova
fn: Alexandra Zhernakova
display name: Alexandra Zhernakova
mg_draft: false
mg_insertedOn: 2026-05-13T12:02:12
mg_updatedOn: 2026-05-13T12:02:12

EGAS50000000483 Marco de Bruyn
type: Contacts
type: Observation
type: Kind
type: Individual
endpoint URL: catalogue_rdf
data set: Contacts
resource: EGAS50000000483
role: http://umcgresearchdatacatalogue.nl/CatalogueOntologies/api/rdf/ContributionTypes/name=Principal%20Investigator
has role: http://umcgresearchdatacatalogue.nl/CatalogueOntologies/api/rdf/ContributionTypes/name=Principal%20Investigator
first name: Marco
family name: de Bruyn
last name: de Bruyn
name: Marco de Bruyn
has name: Marco de Bruyn
fn: Marco de Bruyn
display name: Marco de Bruyn
mg_draft: false
mg_insertedOn: 2026-05-13T12:02:12
mg_updatedOn: 2026-05-13T12:02:12

PSI IBD Kim Sloot
type: Contacts
type: Observation
type: Kind
type: Individual
endpoint URL: catalogue_rdf
data set: Contacts
resource: PSI IBD
role: http://umcgresearchdatacatalogue.nl/CatalogueOntologies/api/rdf/ContributionTypes/name=Primary%20contact
has role: http://umcgresearchdatacatalogue.nl/CatalogueOntologies/api/rdf/ContributionTypes/name=Primary%20contact
first name: Kim
family name: Sloot
last name: Sloot
name: Kim Sloot
has name: Kim Sloot
fn: Kim Sloot
display name: Kim Sloot
prefix: van der
initials: K.W.J.
mg_insertedOn: 2026-05-13T12:02:12
mg_updatedOn: 2026-05-13T12:02:12

LIFELINES_NEXT METc2015/600
type: External identifiers
type: Observation
endpoint URL: catalogue_rdf
data set: External identifiers
resource: LIFELINES_NEXT
identifier: METc2015/600
external identifier type: http://umcgresearchdatacatalogue.nl/CatalogueOntologies/api/rdf/ExternalIdentifierTypes/name=METc%20number
mg_insertedOn: 2026-05-13T12:02:12
mg_updatedOn: 2026-05-13T12:02:12

AcuteLines 2019/589
type: External identifiers
type: Observation
endpoint URL: catalogue_rdf
data set: External identifiers
resource: AcuteLines
identifier: 2019/589
external identifier type: http://umcgresearchdatacatalogue.nl/CatalogueOntologies/api/rdf/ExternalIdentifierTypes/name=METc%20number
mg_insertedOn: 2026-05-13T12:02:12
mg_updatedOn: 2026-05-13T12:02:12

AcuteLines NCT04615065
type: External identifiers
type: Observation
endpoint URL: catalogue_rdf
data set: External identifiers
resource: AcuteLines
identifier: NCT04615065
external identifier type: http://umcgresearchdatacatalogue.nl/CatalogueOntologies/api/rdf/ExternalIdentifierTypes/name=Clinical%20Trials.gov
mg_insertedOn: 2026-05-13T12:02:12
mg_updatedOn: 2026-05-13T12:02:12

EGAS00001000644 EGAS00001000644
type: External identifiers
type: Observation
endpoint URL: catalogue_rdf
data set: External identifiers
resource: EGAS00001000644
identifier: EGAS00001000644
external identifier type other: EGA study
mg_insertedOn: 2026-05-13T12:02:12
mg_updatedOn: 2026-05-13T12:02:12

EGAS00001006999 EGAS00001006999
type: External identifiers
type: Observation
endpoint URL: catalogue_rdf
data set: External identifiers
resource: EGAS00001006999
identifier: EGAS00001006999
external identifier type other: EGA study
mg_insertedOn: 2026-05-13T12:02:12
mg_updatedOn: 2026-05-13T12:02:12

EGAS00001002169 EGAS00001002169
type: External identifiers
type: Observation
endpoint URL: catalogue_rdf
data set: External identifiers
resource: EGAS00001002169
identifier: EGAS00001002169
external identifier type other: EGA study
mg_insertedOn: 2026-05-13T12:02:12
mg_updatedOn: 2026-05-13T12:02:12

EGAS00001002560 EGAS00001002560
type: External identifiers
type: Observation
endpoint URL: catalogue_rdf
data set: External identifiers
resource: EGAS00001002560
identifier: EGAS00001002560
external identifier type other: EGA study
mg_insertedOn: 2026-05-13T12:02:12
mg_updatedOn: 2026-05-13T12:02:12

EGAS00001003735 EGAS00001003735
type: External identifiers
type: Observation
endpoint URL: catalogue_rdf
data set: External identifiers
resource: EGAS00001003735
identifier: EGAS00001003735
external identifier type other: EGA study
mg_insertedOn: 2026-05-13T12:02:12
mg_updatedOn: 2026-05-13T12:02:12

EGAS00001003739 EGAS00001003739
type: External identifiers
type: Observation
endpoint URL: catalogue_rdf
data set: External identifiers
resource: EGAS00001003739
identifier: EGAS00001003739
external identifier type other: EGA study
mg_insertedOn: 2026-05-13T12:02:12
mg_updatedOn: 2026-05-13T12:02:12

EGAS00001003805 EGAS00001003805
type: External identifiers
type: Observation
endpoint URL: catalogue_rdf
data set: External identifiers
resource: EGAS00001003805
identifier: EGAS00001003805
external identifier type other: EGA study
mg_insertedOn: 2026-05-13T12:02:12
mg_updatedOn: 2026-05-13T12:02:12

EGAS00001004766 EGAS00001004766
type: External identifiers
type: Observation
endpoint URL: catalogue_rdf
data set: External identifiers
resource: EGAS00001004766
identifier: EGAS00001004766
external identifier type other: EGA study
mg_insertedOn: 2026-05-13T12:02:12
mg_updatedOn: 2026-05-13T12:02:12

EGAS00001005027 EGAS00001005027
type: External identifiers
type: Observation
endpoint URL: catalogue_rdf
data set: External identifiers
resource: EGAS00001005027
identifier: EGAS00001005027
external identifier type other: EGA study
mg_insertedOn: 2026-05-13T12:02:12
mg_updatedOn: 2026-05-13T12:02:12

EGAS00001005189 EGAS00001005189
type: External identifiers
type: Observation
endpoint URL: catalogue_rdf
data set: External identifiers
resource: EGAS00001005189
identifier: EGAS00001005189
external identifier type other: EGA study
mg_insertedOn: 2026-05-13T12:02:12
mg_updatedOn: 2026-05-13T12:02:12

EGAS00001005225 EGAS00001005225
type: External identifiers
type: Observation
endpoint URL: catalogue_rdf
data set: External identifiers
resource: EGAS00001005225
identifier: EGAS00001005225
external identifier type other: EGA study
mg_insertedOn: 2026-05-13T12:02:12
mg_updatedOn: 2026-05-13T12:02:12

EGAS00001005376 EGAS00001005376
type: External identifiers
type: Observation
endpoint URL: catalogue_rdf
data set: External identifiers
resource: EGAS00001005376
identifier: EGAS00001005376
external identifier type other: EGA study
mg_insertedOn: 2026-05-13T12:02:12
mg_updatedOn: 2026-05-13T12:02:12

EGAS00001006258 EGAS00001006258
type: External identifiers
type: Observation
endpoint URL: catalogue_rdf
data set: External identifiers
resource: EGAS00001006258
identifier: EGAS00001006258
external identifier type other: EGA study
mg_insertedOn: 2026-05-13T12:02:12
mg_updatedOn: 2026-05-13T12:02:12

EGAS00001006347 EGAS00001006347
type: External identifiers
type: Observation
endpoint URL: catalogue_rdf
data set: External identifiers
resource: EGAS00001006347
identifier: EGAS00001006347
external identifier type other: EGA study
mg_insertedOn: 2026-05-13T12:02:12
mg_updatedOn: 2026-05-13T12:02:12

EGAS00001006657 EGAS00001006657
type: External identifiers
type: Observation
endpoint URL: catalogue_rdf
data set: External identifiers
resource: EGAS00001006657
identifier: EGAS00001006657
external identifier type other: EGA study
mg_insertedOn: 2026-05-13T12:02:12
mg_updatedOn: 2026-05-13T12:02:12

EGAS00001007021 EGAS00001007021
type: External identifiers
type: Observation
endpoint URL: catalogue_rdf
data set: External identifiers
resource: EGAS00001007021
identifier: EGAS00001007021
external identifier type other: EGA study
mg_insertedOn: 2026-05-13T12:02:12
mg_updatedOn: 2026-05-13T12:02:12

EGAS00001007054 EGAS00001007054
type: External identifiers
type: Observation
endpoint URL: catalogue_rdf
data set: External identifiers
resource: EGAS00001007054
identifier: EGAS00001007054
external identifier type other: EGA study
mg_insertedOn: 2026-05-13T12:02:12
mg_updatedOn: 2026-05-13T12:02:12

EGAS00001007450 EGAS00001007450
type: External identifiers
type: Observation
endpoint URL: catalogue_rdf
data set: External identifiers
resource: EGAS00001007450
identifier: EGAS00001007450
external identifier type other: EGA study
mg_insertedOn: 2026-05-13T12:02:12
mg_updatedOn: 2026-05-13T12:02:12

EGAS00001007571 EGAS00001007571
type: External identifiers
type: Observation
endpoint URL: catalogue_rdf
data set: External identifiers
resource: EGAS00001007571
identifier: EGAS00001007571
external identifier type other: EGA study
mg_insertedOn: 2026-05-13T12:02:12
mg_updatedOn: 2026-05-13T12:02:12

EGAS50000000133 EGAS50000000133
type: External identifiers
type: Observation
endpoint URL: catalogue_rdf
data set: External identifiers
resource: EGAS50000000133
identifier: EGAS50000000133
external identifier type other: EGA study
mg_insertedOn: 2026-05-13T12:02:12
mg_updatedOn: 2026-05-13T12:02:12

EGAS50000000483 EGAS50000000483
type: External identifiers
type: Observation
endpoint URL: catalogue_rdf
data set: External identifiers
resource: EGAS50000000483
identifier: EGAS50000000483
external identifier type other: EGA study
mg_insertedOn: 2026-05-13T12:02:12
mg_updatedOn: 2026-05-13T12:02:12

OncoLifeS OZG
type: Organisations
type: Observation
type: Agent
type: Organization
endpoint URL: catalogue_rdf
data set: Organisations
resource: OncoLifeS
id: OZG
type: http://umcgresearchdatacatalogue.nl/CatalogueOntologies/api/rdf/AgentTypes/name=Organisation
organisation: http://umcgresearchdatacatalogue.nl/CatalogueOntologies/api/rdf/Organisations/name=Ommelander%20Ziekenhuis%20Groningen
name: Ommelander Ziekenhuis Groningen
organisation name: Ommelander Ziekenhuis Groningen
organisation pid: https://ror.org/02mh2ah12
organisation website: www.ommelanderziekenhuis.nl
is lead organisation: false
mg_draft: false
mg_insertedOn: 2026-05-13T12:02:12
mg_updatedOn: 2026-05-13T12:02:12
mg_tableclass: catalogue_rdf.Organisations

LIFELINES_NEXT UMCG
type: Organisations
type: Observation
type: Agent
type: Organization
endpoint URL: catalogue_rdf
data set: Organisations
resource: LIFELINES_NEXT
id: UMCG
type: http://umcgresearchdatacatalogue.nl/CatalogueOntologies/api/rdf/AgentTypes/name=Organisation
organisation: http://umcgresearchdatacatalogue.nl/CatalogueOntologies/api/rdf/Organisations/name=University%20Medical%20Center%20Groningen
name: University Medical Center Groningen
organisation name: University Medical Center Groningen
organisation pid: https://ror.org/03cv38k47
organisation website: www.umcg.nl
is lead organisation: true
mg_draft: false
mg_insertedOn: 2026-05-13T12:02:12
mg_updatedOn: 2026-05-13T12:02:12
mg_tableclass: catalogue_rdf.Organisations

AHON UMCG
type: Organisations
type: Observation
type: Agent
type: Organization
endpoint URL: catalogue_rdf
data set: Organisations
resource: AHON
id: UMCG
type: http://umcgresearchdatacatalogue.nl/CatalogueOntologies/api/rdf/AgentTypes/name=Organisation
organisation: http://umcgresearchdatacatalogue.nl/CatalogueOntologies/api/rdf/Organisations/name=University%20Medical%20Center%20Groningen
name: University Medical Center Groningen
organisation name: University Medical Center Groningen
organisation pid: https://ror.org/03cv38k47
organisation website: www.umcg.nl
is lead organisation: true
mg_draft: false
mg_insertedOn: 2026-05-13T12:02:12
mg_updatedOn: 2026-05-13T12:02:12
mg_tableclass: catalogue_rdf.Organisations

AHON UMCU
type: Organisations
type: Observation
type: Agent
type: Organization
endpoint URL: catalogue_rdf
data set: Organisations
resource: AHON
id: UMCU
type: http://umcgresearchdatacatalogue.nl/CatalogueOntologies/api/rdf/AgentTypes/name=Organisation
organisation: http://umcgresearchdatacatalogue.nl/CatalogueOntologies/api/rdf/Organisations/name=University%20Medical%20Center%20Utrecht
name: University Medical Center Utrecht
organisation name: University Medical Center Utrecht
organisation pid: https://ror.org/0575yy874
organisation website: www.umcutrecht.nl
is lead organisation: false
mg_draft: false
mg_insertedOn: 2026-05-13T12:02:12
mg_updatedOn: 2026-05-13T12:02:12
mg_tableclass: catalogue_rdf.Organisations

AcuteLines UMCG
type: Organisations
type: Observation
type: Agent
type: Organization
endpoint URL: catalogue_rdf
data set: Organisations
resource: AcuteLines
id: UMCG
type: http://umcgresearchdatacatalogue.nl/CatalogueOntologies/api/rdf/AgentTypes/name=Organisation
organisation: http://umcgresearchdatacatalogue.nl/CatalogueOntologies/api/rdf/Organisations/name=University%20Medical%20Center%20Groningen
name: University Medical Center Groningen
organisation name: University Medical Center Groningen
organisation pid: https://ror.org/03cv38k47
organisation website: www.umcg.nl
is lead organisation: true
mg_draft: false
mg_insertedOn: 2026-05-13T12:02:12
mg_updatedOn: 2026-05-13T12:02:12
mg_tableclass: catalogue_rdf.Organisations

LIFELINES_NEXT Lifelines
type: Organisations
type: Observation
type: Agent
type: Organization
endpoint URL: catalogue_rdf
data set: Organisations
resource: LIFELINES_NEXT
id: Lifelines
type: http://umcgresearchdatacatalogue.nl/CatalogueOntologies/api/rdf/AgentTypes/name=Organisation
organisation: http://umcgresearchdatacatalogue.nl/CatalogueOntologies/api/rdf/Organisations/name=Lifelines
name: Lifelines
organisation name: Lifelines
organisation pid: https://ror.org/01ja6ps71
organisation website: www.lifelines.nl
is lead organisation: false
mg_draft: false
mg_insertedOn: 2026-05-13T12:02:12
mg_updatedOn: 2026-05-13T12:02:12
mg_tableclass: catalogue_rdf.Organisations

AHON AMC
type: Organisations
type: Observation
type: Agent
type: Organization
endpoint URL: catalogue_rdf
data set: Organisations
resource: AHON
id: AMC
type: http://umcgresearchdatacatalogue.nl/CatalogueOntologies/api/rdf/AgentTypes/name=Organisation
organisation: http://umcgresearchdatacatalogue.nl/CatalogueOntologies/api/rdf/Organisations/name=Amsterdam%20University%20Medical%20Centers
name: Amsterdam University Medical Centers
organisation name: Amsterdam University Medical Centers
organisation pid: https://ror.org/05grdyy37
organisation website: www.amsterdamumc.org
is lead organisation: false
mg_draft: false
mg_insertedOn: 2026-05-13T12:02:12
mg_updatedOn: 2026-05-13T12:02:12
mg_tableclass: catalogue_rdf.Organisations

AHON MU
type: Organisations
type: Observation
type: Agent
type: Organization
endpoint URL: catalogue_rdf
data set: Organisations
resource: AHON
id: MU
type: http://umcgresearchdatacatalogue.nl/CatalogueOntologies/api/rdf/AgentTypes/name=Organisation
organisation: http://umcgresearchdatacatalogue.nl/CatalogueOntologies/api/rdf/Organisations/name=Maastricht%20University%20Medical%20Centre
name: Maastricht University Medical Centre
organisation name: Maastricht University Medical Centre
organisation pid: https://ror.org/02d9ce178
organisation website: www.mumc.nl
is lead organisation: false
mg_draft: false
mg_insertedOn: 2026-05-13T12:02:12
mg_updatedOn: 2026-05-13T12:02:12
mg_tableclass: catalogue_rdf.Organisations

OncoLifeS UMCG
type: Organisations
type: Observation
type: Agent
type: Organization
endpoint URL: catalogue_rdf
data set: Organisations
resource: OncoLifeS
id: UMCG
type: http://umcgresearchdatacatalogue.nl/CatalogueOntologies/api/rdf/AgentTypes/name=Organisation
organisation: http://umcgresearchdatacatalogue.nl/CatalogueOntologies/api/rdf/Organisations/name=University%20Medical%20Center%20Groningen
name: University Medical Center Groningen
organisation name: University Medical Center Groningen
organisation pid: https://ror.org/03cv38k47
organisation website: www.umcg.nl
is lead organisation: true
mg_draft: false
mg_insertedOn: 2026-05-13T12:02:12
mg_updatedOn: 2026-05-13T12:02:12
mg_tableclass: catalogue_rdf.Organisations

EGAS00001000644 UMCG
type: Organisations
type: Observation
type: Agent
type: Organization
endpoint URL: catalogue_rdf
data set: Organisations
resource: EGAS00001000644
id: UMCG
type: http://umcgresearchdatacatalogue.nl/CatalogueOntologies/api/rdf/AgentTypes/name=Organisation
organisation: http://umcgresearchdatacatalogue.nl/CatalogueOntologies/api/rdf/Organisations/name=University%20Medical%20Center%20Groningen
role: http://umcgresearchdatacatalogue.nl/CatalogueOntologies/api/rdf/OrganisationRoles/name=Data%20access%20provider
name: University Medical Center Groningen
organisation name: University Medical Center Groningen
organisation pid: https://ror.org/03cv38k47
organisation website: www.umcg.nl
is lead organisation: true
mg_draft: false
mg_insertedOn: 2026-05-13T12:02:12
mg_updatedOn: 2026-05-13T12:02:12
mg_tableclass: catalogue_rdf.Organisations

UMCG UMCG
type: Organisations
type: Observation
type: Agent
type: Organization
endpoint URL: catalogue_rdf
data set: Organisations
resource: UMCG
id: UMCG
type: http://umcgresearchdatacatalogue.nl/CatalogueOntologies/api/rdf/AgentTypes/name=Organisation
department: Genomics Coordination Center, MOLGENIS
name: University Medical Center Groningen
organisation name: University Medical Center Groningen
organisation pid: https://ror.org/03cv38k47
organisation website: www.umcg.nl
is lead organisation: true
mg_draft: false
mg_insertedOn: 2026-05-13T12:02:12
mg_updatedOn: 2026-05-13T12:02:12
mg_tableclass: catalogue_rdf.Organisations

EGAS00001006999 UMCG
type: Organisations
type: Observation
type: Agent
type: Organization
endpoint URL: catalogue_rdf
data set: Organisations
resource: EGAS00001006999
id: UMCG
type: http://umcgresearchdatacatalogue.nl/CatalogueOntologies/api/rdf/AgentTypes/name=Organisation
organisation: http://umcgresearchdatacatalogue.nl/CatalogueOntologies/api/rdf/Organisations/name=University%20Medical%20Center%20Groningen
role: http://umcgresearchdatacatalogue.nl/CatalogueOntologies/api/rdf/OrganisationRoles/name=Data%20access%20provider
name: University Medical Center Groningen
organisation name: University Medical Center Groningen
organisation pid: https://ror.org/03cv38k47
organisation website: www.umcg.nl
is lead organisation: true
mg_draft: false
mg_insertedOn: 2026-05-13T12:02:12
mg_updatedOn: 2026-05-13T12:02:12
mg_tableclass: catalogue_rdf.Organisations

EGAS00001002169 UMCG
type: Organisations
type: Observation
type: Agent
type: Organization
endpoint URL: catalogue_rdf
data set: Organisations
resource: EGAS00001002169
id: UMCG
type: http://umcgresearchdatacatalogue.nl/CatalogueOntologies/api/rdf/AgentTypes/name=Organisation
organisation: http://umcgresearchdatacatalogue.nl/CatalogueOntologies/api/rdf/Organisations/name=University%20Medical%20Center%20Groningen
role: http://umcgresearchdatacatalogue.nl/CatalogueOntologies/api/rdf/OrganisationRoles/name=Data%20access%20provider
name: University Medical Center Groningen
organisation name: University Medical Center Groningen
organisation pid: https://ror.org/03cv38k47
organisation website: www.umcg.nl
is lead organisation: true
mg_draft: false
mg_insertedOn: 2026-05-13T12:02:12
mg_updatedOn: 2026-05-13T12:02:12
mg_tableclass: catalogue_rdf.Organisations

EGAS00001002560 UMCG
type: Organisations
type: Observation
type: Agent
type: Organization
endpoint URL: catalogue_rdf
data set: Organisations
resource: EGAS00001002560
id: UMCG
type: http://umcgresearchdatacatalogue.nl/CatalogueOntologies/api/rdf/AgentTypes/name=Organisation
organisation: http://umcgresearchdatacatalogue.nl/CatalogueOntologies/api/rdf/Organisations/name=University%20Medical%20Center%20Groningen
role: http://umcgresearchdatacatalogue.nl/CatalogueOntologies/api/rdf/OrganisationRoles/name=Data%20access%20provider
name: University Medical Center Groningen
organisation name: University Medical Center Groningen
organisation pid: https://ror.org/03cv38k47
organisation website: www.umcg.nl
is lead organisation: true
mg_draft: false
mg_insertedOn: 2026-05-13T12:02:12
mg_updatedOn: 2026-05-13T12:02:12
mg_tableclass: catalogue_rdf.Organisations

EGAS00001003735 UMCG
type: Organisations
type: Observation
type: Agent
type: Organization
endpoint URL: catalogue_rdf
data set: Organisations
resource: EGAS00001003735
id: UMCG
type: http://umcgresearchdatacatalogue.nl/CatalogueOntologies/api/rdf/AgentTypes/name=Organisation
organisation: http://umcgresearchdatacatalogue.nl/CatalogueOntologies/api/rdf/Organisations/name=University%20Medical%20Center%20Groningen
role: http://umcgresearchdatacatalogue.nl/CatalogueOntologies/api/rdf/OrganisationRoles/name=Data%20access%20provider
name: University Medical Center Groningen
organisation name: University Medical Center Groningen
organisation pid: https://ror.org/03cv38k47
organisation website: www.umcg.nl
is lead organisation: true
mg_draft: false
mg_insertedOn: 2026-05-13T12:02:12
mg_updatedOn: 2026-05-13T12:02:12
mg_tableclass: catalogue_rdf.Organisations

EGAS00001003739 UMCG
type: Organisations
type: Observation
type: Agent
type: Organization
endpoint URL: catalogue_rdf
data set: Organisations
resource: EGAS00001003739
id: UMCG
type: http://umcgresearchdatacatalogue.nl/CatalogueOntologies/api/rdf/AgentTypes/name=Organisation
organisation: http://umcgresearchdatacatalogue.nl/CatalogueOntologies/api/rdf/Organisations/name=University%20Medical%20Center%20Groningen
role: http://umcgresearchdatacatalogue.nl/CatalogueOntologies/api/rdf/OrganisationRoles/name=Data%20access%20provider
name: University Medical Center Groningen
organisation name: University Medical Center Groningen
organisation pid: https://ror.org/03cv38k47
organisation website: www.umcg.nl
is lead organisation: true
mg_draft: false
mg_insertedOn: 2026-05-13T12:02:12
mg_updatedOn: 2026-05-13T12:02:12
mg_tableclass: catalogue_rdf.Organisations

EGAS00001003805 UMCG
type: Organisations
type: Observation
type: Agent
type: Organization
endpoint URL: catalogue_rdf
data set: Organisations
resource: EGAS00001003805
id: UMCG
type: http://umcgresearchdatacatalogue.nl/CatalogueOntologies/api/rdf/AgentTypes/name=Organisation
organisation: http://umcgresearchdatacatalogue.nl/CatalogueOntologies/api/rdf/Organisations/name=University%20Medical%20Center%20Groningen
role: http://umcgresearchdatacatalogue.nl/CatalogueOntologies/api/rdf/OrganisationRoles/name=Data%20access%20provider
name: University Medical Center Groningen
organisation name: University Medical Center Groningen
organisation pid: https://ror.org/03cv38k47
organisation website: www.umcg.nl
is lead organisation: true
mg_draft: false
mg_insertedOn: 2026-05-13T12:02:12
mg_updatedOn: 2026-05-13T12:02:12
mg_tableclass: catalogue_rdf.Organisations

EGAS00001004766 UMCG
type: Organisations
type: Observation
type: Agent
type: Organization
endpoint URL: catalogue_rdf
data set: Organisations
resource: EGAS00001004766
id: UMCG
type: http://umcgresearchdatacatalogue.nl/CatalogueOntologies/api/rdf/AgentTypes/name=Organisation
organisation: http://umcgresearchdatacatalogue.nl/CatalogueOntologies/api/rdf/Organisations/name=University%20Medical%20Center%20Groningen
role: http://umcgresearchdatacatalogue.nl/CatalogueOntologies/api/rdf/OrganisationRoles/name=Data%20access%20provider
name: University Medical Center Groningen
organisation name: University Medical Center Groningen
organisation pid: https://ror.org/03cv38k47
organisation website: www.umcg.nl
is lead organisation: true
mg_draft: false
mg_insertedOn: 2026-05-13T12:02:12
mg_updatedOn: 2026-05-13T12:02:12
mg_tableclass: catalogue_rdf.Organisations

EGAS00001005027 UMCG
type: Organisations
type: Observation
type: Agent
type: Organization
endpoint URL: catalogue_rdf
data set: Organisations
resource: EGAS00001005027
id: UMCG
type: http://umcgresearchdatacatalogue.nl/CatalogueOntologies/api/rdf/AgentTypes/name=Organisation
organisation: http://umcgresearchdatacatalogue.nl/CatalogueOntologies/api/rdf/Organisations/name=University%20Medical%20Center%20Groningen
role: http://umcgresearchdatacatalogue.nl/CatalogueOntologies/api/rdf/OrganisationRoles/name=Data%20access%20provider
name: University Medical Center Groningen
organisation name: University Medical Center Groningen
organisation pid: https://ror.org/03cv38k47
organisation website: www.umcg.nl
is lead organisation: true
mg_insertedOn: 2026-05-13T12:02:12
mg_updatedOn: 2026-05-13T12:02:12
mg_tableclass: catalogue_rdf.Organisations

EGAS00001005189 UMCG
type: Organisations
type: Observation
type: Agent
type: Organization
endpoint URL: catalogue_rdf
data set: Organisations
resource: EGAS00001005189
id: UMCG
type: http://umcgresearchdatacatalogue.nl/CatalogueOntologies/api/rdf/AgentTypes/name=Organisation
organisation: http://umcgresearchdatacatalogue.nl/CatalogueOntologies/api/rdf/Organisations/name=University%20Medical%20Center%20Groningen
role: http://umcgresearchdatacatalogue.nl/CatalogueOntologies/api/rdf/OrganisationRoles/name=Data%20access%20provider
name: University Medical Center Groningen
organisation name: University Medical Center Groningen
organisation pid: https://ror.org/03cv38k47
organisation website: www.umcg.nl
is lead organisation: true
mg_draft: false
mg_insertedOn: 2026-05-13T12:02:12
mg_updatedOn: 2026-05-13T12:02:12
mg_tableclass: catalogue_rdf.Organisations

EGAS00001005225 UMCG
type: Organisations
type: Observation
type: Agent
type: Organization
endpoint URL: catalogue_rdf
data set: Organisations
resource: EGAS00001005225
id: UMCG
type: http://umcgresearchdatacatalogue.nl/CatalogueOntologies/api/rdf/AgentTypes/name=Organisation
organisation: http://umcgresearchdatacatalogue.nl/CatalogueOntologies/api/rdf/Organisations/name=University%20Medical%20Center%20Groningen
role: http://umcgresearchdatacatalogue.nl/CatalogueOntologies/api/rdf/OrganisationRoles/name=Data%20access%20provider
name: University Medical Center Groningen
organisation name: University Medical Center Groningen
organisation pid: https://ror.org/03cv38k47
organisation website: www.umcg.nl
is lead organisation: true
mg_draft: false
mg_insertedOn: 2026-05-13T12:02:12
mg_updatedOn: 2026-05-13T12:02:12
mg_tableclass: catalogue_rdf.Organisations

EGAS00001005376 UMCG
type: Organisations
type: Observation
type: Agent
type: Organization
endpoint URL: catalogue_rdf
data set: Organisations
resource: EGAS00001005376
id: UMCG
type: http://umcgresearchdatacatalogue.nl/CatalogueOntologies/api/rdf/AgentTypes/name=Organisation
organisation: http://umcgresearchdatacatalogue.nl/CatalogueOntologies/api/rdf/Organisations/name=University%20Medical%20Center%20Groningen
role: http://umcgresearchdatacatalogue.nl/CatalogueOntologies/api/rdf/OrganisationRoles/name=Data%20access%20provider
name: University Medical Center Groningen
organisation name: University Medical Center Groningen
organisation pid: https://ror.org/03cv38k47
organisation website: www.umcg.nl
is lead organisation: true
mg_draft: false
mg_insertedOn: 2026-05-13T12:02:12
mg_updatedOn: 2026-05-13T12:02:12
mg_tableclass: catalogue_rdf.Organisations

EGAS00001006258 UMCG
type: Organisations
type: Observation
type: Agent
type: Organization
endpoint URL: catalogue_rdf
data set: Organisations
resource: EGAS00001006258
id: UMCG
type: http://umcgresearchdatacatalogue.nl/CatalogueOntologies/api/rdf/AgentTypes/name=Organisation
organisation: http://umcgresearchdatacatalogue.nl/CatalogueOntologies/api/rdf/Organisations/name=University%20Medical%20Center%20Groningen
role: http://umcgresearchdatacatalogue.nl/CatalogueOntologies/api/rdf/OrganisationRoles/name=Data%20access%20provider
name: University Medical Center Groningen
organisation name: University Medical Center Groningen
organisation pid: https://ror.org/03cv38k47
organisation website: www.umcg.nl
is lead organisation: true
mg_draft: false
mg_insertedOn: 2026-05-13T12:02:12
mg_updatedOn: 2026-05-13T12:02:12
mg_tableclass: catalogue_rdf.Organisations

EGAS00001006347 UMCG
type: Organisations
type: Observation
type: Agent
type: Organization
endpoint URL: catalogue_rdf
data set: Organisations
resource: EGAS00001006347
id: UMCG
type: http://umcgresearchdatacatalogue.nl/CatalogueOntologies/api/rdf/AgentTypes/name=Organisation
organisation: http://umcgresearchdatacatalogue.nl/CatalogueOntologies/api/rdf/Organisations/name=University%20Medical%20Center%20Groningen
role: http://umcgresearchdatacatalogue.nl/CatalogueOntologies/api/rdf/OrganisationRoles/name=Data%20access%20provider
name: University Medical Center Groningen
organisation name: University Medical Center Groningen
organisation pid: https://ror.org/03cv38k47
organisation website: www.umcg.nl
is lead organisation: true
mg_draft: false
mg_insertedOn: 2026-05-13T12:02:12
mg_updatedOn: 2026-05-13T12:02:12
mg_tableclass: catalogue_rdf.Organisations

EGAS00001006657 UMCG
type: Organisations
type: Observation
type: Agent
type: Organization
endpoint URL: catalogue_rdf
data set: Organisations
resource: EGAS00001006657
id: UMCG
type: http://umcgresearchdatacatalogue.nl/CatalogueOntologies/api/rdf/AgentTypes/name=Organisation
organisation: http://umcgresearchdatacatalogue.nl/CatalogueOntologies/api/rdf/Organisations/name=University%20Medical%20Center%20Groningen
role: http://umcgresearchdatacatalogue.nl/CatalogueOntologies/api/rdf/OrganisationRoles/name=Data%20access%20provider
name: University Medical Center Groningen
organisation name: University Medical Center Groningen
organisation pid: https://ror.org/03cv38k47
organisation website: www.umcg.nl
is lead organisation: true
mg_draft: false
mg_insertedOn: 2026-05-13T12:02:12
mg_updatedOn: 2026-05-13T12:02:12
mg_tableclass: catalogue_rdf.Organisations

EGAS00001007021 UMCG
type: Organisations
type: Observation
type: Agent
type: Organization
endpoint URL: catalogue_rdf
data set: Organisations
resource: EGAS00001007021
id: UMCG
type: http://umcgresearchdatacatalogue.nl/CatalogueOntologies/api/rdf/AgentTypes/name=Organisation
organisation: http://umcgresearchdatacatalogue.nl/CatalogueOntologies/api/rdf/Organisations/name=University%20Medical%20Center%20Groningen
role: http://umcgresearchdatacatalogue.nl/CatalogueOntologies/api/rdf/OrganisationRoles/name=Data%20access%20provider
name: University Medical Center Groningen
organisation name: University Medical Center Groningen
organisation pid: https://ror.org/03cv38k47
organisation website: www.umcg.nl
is lead organisation: true
mg_draft: false
mg_insertedOn: 2026-05-13T12:02:12
mg_updatedOn: 2026-05-13T12:02:12
mg_tableclass: catalogue_rdf.Organisations

EGAS00001007054 UMCG
type: Organisations
type: Observation
type: Agent
type: Organization
endpoint URL: catalogue_rdf
data set: Organisations
resource: EGAS00001007054
id: UMCG
type: http://umcgresearchdatacatalogue.nl/CatalogueOntologies/api/rdf/AgentTypes/name=Organisation
organisation: http://umcgresearchdatacatalogue.nl/CatalogueOntologies/api/rdf/Organisations/name=University%20Medical%20Center%20Groningen
role: http://umcgresearchdatacatalogue.nl/CatalogueOntologies/api/rdf/OrganisationRoles/name=Data%20access%20provider
name: University Medical Center Groningen
organisation name: University Medical Center Groningen
organisation pid: https://ror.org/03cv38k47
organisation website: www.umcg.nl
is lead organisation: true
mg_draft: false
mg_insertedOn: 2026-05-13T12:02:12
mg_updatedOn: 2026-05-13T12:02:12
mg_tableclass: catalogue_rdf.Organisations

EGAS00001007450 UMCG
type: Organisations
type: Observation
type: Agent
type: Organization
endpoint URL: catalogue_rdf
data set: Organisations
resource: EGAS00001007450
id: UMCG
type: http://umcgresearchdatacatalogue.nl/CatalogueOntologies/api/rdf/AgentTypes/name=Organisation
organisation: http://umcgresearchdatacatalogue.nl/CatalogueOntologies/api/rdf/Organisations/name=University%20Medical%20Center%20Groningen
role: http://umcgresearchdatacatalogue.nl/CatalogueOntologies/api/rdf/OrganisationRoles/name=Data%20access%20provider
name: University Medical Center Groningen
organisation name: University Medical Center Groningen
organisation pid: https://ror.org/03cv38k47
organisation website: www.umcg.nl
is lead organisation: true
mg_draft: false
mg_insertedOn: 2026-05-13T12:02:12
mg_updatedOn: 2026-05-13T12:02:12
mg_tableclass: catalogue_rdf.Organisations

EGAS00001007571 UMCG
type: Organisations
type: Observation
type: Agent
type: Organization
endpoint URL: catalogue_rdf
data set: Organisations
resource: EGAS00001007571
id: UMCG
type: http://umcgresearchdatacatalogue.nl/CatalogueOntologies/api/rdf/AgentTypes/name=Organisation
organisation: http://umcgresearchdatacatalogue.nl/CatalogueOntologies/api/rdf/Organisations/name=University%20Medical%20Center%20Groningen
role: http://umcgresearchdatacatalogue.nl/CatalogueOntologies/api/rdf/OrganisationRoles/name=Data%20access%20provider
name: University Medical Center Groningen
organisation name: University Medical Center Groningen
organisation pid: https://ror.org/03cv38k47
organisation website: www.umcg.nl
is lead organisation: true
mg_draft: false
mg_insertedOn: 2026-05-13T12:02:12
mg_updatedOn: 2026-05-13T12:02:12
mg_tableclass: catalogue_rdf.Organisations

EGAS50000000133 UMCG
type: Organisations
type: Observation
type: Agent
type: Organization
endpoint URL: catalogue_rdf
data set: Organisations
resource: EGAS50000000133
id: UMCG
type: http://umcgresearchdatacatalogue.nl/CatalogueOntologies/api/rdf/AgentTypes/name=Organisation
organisation: http://umcgresearchdatacatalogue.nl/CatalogueOntologies/api/rdf/Organisations/name=University%20Medical%20Center%20Groningen
role: http://umcgresearchdatacatalogue.nl/CatalogueOntologies/api/rdf/OrganisationRoles/name=Data%20access%20provider
name: University Medical Center Groningen
organisation name: University Medical Center Groningen
organisation pid: https://ror.org/03cv38k47
organisation website: www.umcg.nl
is lead organisation: true
mg_draft: false
mg_insertedOn: 2026-05-13T12:02:12
mg_updatedOn: 2026-05-13T12:02:12
mg_tableclass: catalogue_rdf.Organisations

EGAS50000000483 UMCG
type: Organisations
type: Observation
type: Agent
type: Organization
endpoint URL: catalogue_rdf
data set: Organisations
resource: EGAS50000000483
id: UMCG
type: http://umcgresearchdatacatalogue.nl/CatalogueOntologies/api/rdf/AgentTypes/name=Organisation
organisation: http://umcgresearchdatacatalogue.nl/CatalogueOntologies/api/rdf/Organisations/name=University%20Medical%20Center%20Groningen
role: http://umcgresearchdatacatalogue.nl/CatalogueOntologies/api/rdf/OrganisationRoles/name=Data%20access%20provider
name: University Medical Center Groningen
organisation name: University Medical Center Groningen
organisation pid: https://ror.org/03cv38k47
organisation website: www.umcg.nl
is lead organisation: true
mg_draft: false
mg_insertedOn: 2026-05-13T12:02:12
mg_updatedOn: 2026-05-13T12:02:12
mg_tableclass: catalogue_rdf.Organisations

OncoLifeS Treant Zorggroep
type: Organisations
type: Observation
type: Agent
type: Organization
endpoint URL: catalogue_rdf
data set: Organisations
resource: OncoLifeS
id: Treant Zorggroep
type: http://umcgresearchdatacatalogue.nl/CatalogueOntologies/api/rdf/AgentTypes/name=Organisation
organisation: http://umcgresearchdatacatalogue.nl/CatalogueOntologies/api/rdf/Organisations/name=Treant%20Zorggroep
name: Treant Zorggroep
organisation name: Treant Zorggroep
organisation pid: https://ror.org/01tm5k604
organisation website: www.treant.nl
is lead organisation: false
mg_draft: false
mg_insertedOn: 2026-05-13T12:02:12
mg_updatedOn: 2026-05-13T12:02:12
mg_tableclass: catalogue_rdf.Organisations

PSI IBD UMCG
type: Organisations
type: Observation
type: Agent
type: Organization
endpoint URL: catalogue_rdf
data set: Organisations
resource: PSI IBD
id: UMCG
type: http://umcgresearchdatacatalogue.nl/CatalogueOntologies/api/rdf/AgentTypes/name=Organisation
organisation: http://umcgresearchdatacatalogue.nl/CatalogueOntologies/api/rdf/Organisations/name=University%20Medical%20Center%20Groningen
name: University Medical Center Groningen
organisation name: University Medical Center Groningen
organisation pid: https://ror.org/03cv38k47
organisation website: www.umcg.nl
is lead organisation: true
mg_draft: false
mg_insertedOn: 2026-05-13T12:02:12
mg_updatedOn: 2026-05-13T12:02:12
mg_tableclass: catalogue_rdf.Organisations

PSI IBD ICC
type: Organisations
type: Observation
type: Agent
type: Organization
endpoint URL: catalogue_rdf
data set: Organisations
resource: PSI IBD
id: ICC
type: http://umcgresearchdatacatalogue.nl/CatalogueOntologies/api/rdf/AgentTypes/name=Organisation
organisation: http://umcgresearchdatacatalogue.nl/CatalogueOntologies/api/rdf/Organisations/name=Dutch%20Initiative%20on%20Crohn%20and%20Colitis
name: Dutch Initiative on Crohn and Colitis
organisation name: Dutch Initiative on Crohn and Colitis
organisation pid: https://ror.org/03a1ym388
organisation website: icc-ibd.com
is lead organisation: true
mg_draft: false
mg_insertedOn: 2026-05-13T12:02:12
mg_updatedOn: 2026-05-13T12:02:12
mg_tableclass: catalogue_rdf.Organisations

PSI IBD HealthRI
type: Organisations
type: Observation
type: Agent
type: Organization
endpoint URL: catalogue_rdf
data set: Organisations
resource: PSI IBD
id: HealthRI
type: http://umcgresearchdatacatalogue.nl/CatalogueOntologies/api/rdf/AgentTypes/name=Organisation
organisation: http://umcgresearchdatacatalogue.nl/CatalogueOntologies/api/rdf/Organisations/name=Health-RI
name: Health-RI
organisation name: Health-RI
organisation pid: https://ror.org/02xcmp898
organisation website: 02xcmp898
is lead organisation: false
mg_draft: false
mg_insertedOn: 2026-05-13T12:02:12
mg_updatedOn: 2026-05-13T12:02:12
mg_tableclass: catalogue_rdf.Organisations

LIFELINES_NEXT LIFELINES_NEXT LIFELINES_NEXT Partners Adult (18+ years)
type: Subpopulation counts
type: Observation
endpoint URL: catalogue_rdf
data set: Subpopulation counts
resource: LIFELINES_NEXT
subpopulation: LIFELINES_NEXT LIFELINES_NEXT Partners
age group: http://umcgresearchdatacatalogue.nl/CatalogueOntologies/api/rdf/AgeGroups/name=Adult%20%2818%2B%20years%29
N total: 840
N female: 13
N male: 827
mg_insertedOn: 2026-05-13T12:02:12
mg_updatedOn: 2026-05-13T12:02:12

LIFELINES_NEXT LIFELINES_NEXT LIFELINES_NEXT Children Infant (0-23 months)
type: Subpopulation counts
type: Observation
endpoint URL: catalogue_rdf
data set: Subpopulation counts
resource: LIFELINES_NEXT
subpopulation: LIFELINES_NEXT LIFELINES_NEXT Children
age group: http://umcgresearchdatacatalogue.nl/CatalogueOntologies/api/rdf/AgeGroups/name=Infant%20%280-23%20months%29
N total: 1380
N female: 684
N male: 696
mg_insertedOn: 2026-05-13T12:02:12
mg_updatedOn: 2026-05-13T12:02:12

LIFELINES_NEXT LIFELINES_NEXT LIFELINES_NEXT Mothers Adult (18+ years)
type: Subpopulation counts
type: Observation
endpoint URL: catalogue_rdf
data set: Subpopulation counts
resource: LIFELINES_NEXT
subpopulation: LIFELINES_NEXT LIFELINES_NEXT Mothers
age group: http://umcgresearchdatacatalogue.nl/CatalogueOntologies/api/rdf/AgeGroups/name=Adult%20%2818%2B%20years%29
N total: 1450
N female: 1450
N male: 0
mg_insertedOn: 2026-05-13T12:02:12
mg_updatedOn: 2026-05-13T12:02:12

AHON AHON AHON General population All ages
type: Subpopulation counts
type: Observation
endpoint URL: catalogue_rdf
data set: Subpopulation counts
resource: AHON
subpopulation: AHON AHON General population
age group: http://umcgresearchdatacatalogue.nl/CatalogueOntologies/api/rdf/AgeGroups/name=All%20ages
N total: 391000
N female: 191000
N male: 190000
mg_draft: false
mg_insertedOn: 2026-05-13T12:02:12
mg_updatedOn: 2026-05-13T12:02:12

AHON AHON AHON General population Adult (18+ years)
type: Subpopulation counts
type: Observation
endpoint URL: catalogue_rdf
data set: Subpopulation counts
resource: AHON
subpopulation: AHON AHON General population
age group: http://umcgresearchdatacatalogue.nl/CatalogueOntologies/api/rdf/AgeGroups/name=Adult%20%2818%2B%20years%29
N total: 321000
mg_draft: false
mg_insertedOn: 2026-05-13T12:02:12
mg_updatedOn: 2026-05-13T12:02:12

AHON AHON AHON General population Aged (65+ years)
type: Subpopulation counts
type: Observation
endpoint URL: catalogue_rdf
data set: Subpopulation counts
resource: AHON
subpopulation: AHON AHON General population
age group: http://umcgresearchdatacatalogue.nl/CatalogueOntologies/api/rdf/AgeGroups/name=Aged%20%2865%2B%20years%29
N total: 91000
mg_draft: false
mg_insertedOn: 2026-05-13T12:02:12
mg_updatedOn: 2026-05-13T12:02:12

OncoLifeS OncoLifeS OncoLifeS Hepato Pancreato Biliary Tumors Adult (18+ years)
type: Subpopulation counts
type: Observation
endpoint URL: catalogue_rdf
data set: Subpopulation counts
resource: OncoLifeS
subpopulation: OncoLifeS OncoLifeS Hepato Pancreato Biliary Tumors
age group: http://umcgresearchdatacatalogue.nl/CatalogueOntologies/api/rdf/AgeGroups/name=Adult%20%2818%2B%20years%29
N total: 70
N female: 35
N male: 35
mg_insertedOn: 2026-05-13T12:02:12
mg_updatedOn: 2026-05-13T12:02:12

OncoLifeS OncoLifeS OncoLifeS Hematological oncology Adult (18+ years)
type: Subpopulation counts
type: Observation
endpoint URL: catalogue_rdf
data set: Subpopulation counts
resource: OncoLifeS
subpopulation: OncoLifeS OncoLifeS Hematological oncology
age group: http://umcgresearchdatacatalogue.nl/CatalogueOntologies/api/rdf/AgeGroups/name=Adult%20%2818%2B%20years%29
N total: 1530
N female: 580
N male: 950
mg_insertedOn: 2026-05-13T12:02:12
mg_updatedOn: 2026-05-13T12:02:12

OncoLifeS OncoLifeS OncoLifeS Testicular oncology Adult (18+ years)
type: Subpopulation counts
type: Observation
endpoint URL: catalogue_rdf
data set: Subpopulation counts
resource: OncoLifeS
subpopulation: OncoLifeS OncoLifeS Testicular oncology
age group: http://umcgresearchdatacatalogue.nl/CatalogueOntologies/api/rdf/AgeGroups/name=Adult%20%2818%2B%20years%29
N total: 233
N male: 233
mg_insertedOn: 2026-05-13T12:02:12
mg_updatedOn: 2026-05-13T12:02:12

OncoLifeS OncoLifeS OncoLifeS Medical oncology/immunotherapy Adult (18+ years)
type: Subpopulation counts
type: Observation
endpoint URL: catalogue_rdf
data set: Subpopulation counts
resource: OncoLifeS
subpopulation: OncoLifeS OncoLifeS Medical oncology/immunotherapy
age group: http://umcgresearchdatacatalogue.nl/CatalogueOntologies/api/rdf/AgeGroups/name=Adult%20%2818%2B%20years%29
N total: 415
N female: 140
N male: 275
mg_insertedOn: 2026-05-13T12:02:12
mg_updatedOn: 2026-05-13T12:02:12

OncoLifeS OncoLifeS OncoLifeS Skin cancer Adult (18+ years)
type: Subpopulation counts
type: Observation
endpoint URL: catalogue_rdf
data set: Subpopulation counts
resource: OncoLifeS
subpopulation: OncoLifeS OncoLifeS Skin cancer
age group: http://umcgresearchdatacatalogue.nl/CatalogueOntologies/api/rdf/AgeGroups/name=Adult%20%2818%2B%20years%29
N total: 70
N female: 30
N male: 40
mg_insertedOn: 2026-05-13T12:02:12
mg_updatedOn: 2026-05-13T12:02:12

OncoLifeS OncoLifeS OncoLifeS Neuro-endocrine oncology Adult (18+ years)
type: Subpopulation counts
type: Observation
endpoint URL: catalogue_rdf
data set: Subpopulation counts
resource: OncoLifeS
subpopulation: OncoLifeS OncoLifeS Neuro-endocrine oncology
age group: http://umcgresearchdatacatalogue.nl/CatalogueOntologies/api/rdf/AgeGroups/name=Adult%20%2818%2B%20years%29
N total: 145
N female: 70
N male: 75
mg_insertedOn: 2026-05-13T12:02:12
mg_updatedOn: 2026-05-13T12:02:12

OncoLifeS OncoLifeS OncoLifeS Neuro-oncology Adult (18+ years)
type: Subpopulation counts
type: Observation
endpoint URL: catalogue_rdf
data set: Subpopulation counts
resource: OncoLifeS
subpopulation: OncoLifeS OncoLifeS Neuro-oncology
age group: http://umcgresearchdatacatalogue.nl/CatalogueOntologies/api/rdf/AgeGroups/name=Adult%20%2818%2B%20years%29
N total: 105
N female: 30
N male: 75
mg_insertedOn: 2026-05-13T12:02:12
mg_updatedOn: 2026-05-13T12:02:12

OncoLifeS OncoLifeS OncoLifeS Colorectal cancer Adult (18+ years)
type: Subpopulation counts
type: Observation
endpoint URL: catalogue_rdf
data set: Subpopulation counts
resource: OncoLifeS
subpopulation: OncoLifeS OncoLifeS Colorectal cancer
age group: http://umcgresearchdatacatalogue.nl/CatalogueOntologies/api/rdf/AgeGroups/name=Adult%20%2818%2B%20years%29
N total: 160
N female: 70
N male: 90
mg_insertedOn: 2026-05-13T12:02:12
mg_updatedOn: 2026-05-13T12:02:12

OncoLifeS OncoLifeS OncoLifeS Adolescents and young adults (AYA) Adult (25-44 years)
type: Subpopulation counts
type: Observation
endpoint URL: catalogue_rdf
data set: Subpopulation counts
resource: OncoLifeS
subpopulation: OncoLifeS OncoLifeS Adolescents and young adults (AYA)
age group: http://umcgresearchdatacatalogue.nl/CatalogueOntologies/api/rdf/AgeGroups/name=Adult%20%2825-44%20years%29
N total: 5
N female: 4
N male: 1
mg_insertedOn: 2026-05-13T12:02:12
mg_updatedOn: 2026-05-13T12:02:12

OncoLifeS OncoLifeS OncoLifeS Adolescents and young adults (AYA) Young adult (18-24 years)
type: Subpopulation counts
type: Observation
endpoint URL: catalogue_rdf
data set: Subpopulation counts
resource: OncoLifeS
subpopulation: OncoLifeS OncoLifeS Adolescents and young adults (AYA)
age group: http://umcgresearchdatacatalogue.nl/CatalogueOntologies/api/rdf/AgeGroups/name=Young%20adult%20%2818-24%20years%29
N total: 1
N male: 1
mg_insertedOn: 2026-05-13T12:02:12
mg_updatedOn: 2026-05-13T12:02:12

OncoLifeS OncoLifeS OncoLifeS Esophageal and Stomach Carcinoma Adult (18+ years)
type: Subpopulation counts
type: Observation
endpoint URL: catalogue_rdf
data set: Subpopulation counts
resource: OncoLifeS
subpopulation: OncoLifeS OncoLifeS Esophageal and Stomach Carcinoma
age group: http://umcgresearchdatacatalogue.nl/CatalogueOntologies/api/rdf/AgeGroups/name=Adult%20%2818%2B%20years%29
N total: 160
N female: 35
N male: 125
mg_insertedOn: 2026-05-13T12:02:12
mg_updatedOn: 2026-05-13T12:02:12

OncoLifeS OncoLifeS OncoLifeS Adrenal cancer Adult (18+ years)
type: Subpopulation counts
type: Observation
endpoint URL: catalogue_rdf
data set: Subpopulation counts
resource: OncoLifeS
subpopulation: OncoLifeS OncoLifeS Adrenal cancer
age group: http://umcgresearchdatacatalogue.nl/CatalogueOntologies/api/rdf/AgeGroups/name=Adult%20%2818%2B%20years%29
N total: 5
N female: 1
N male: 4
mg_insertedOn: 2026-05-13T12:02:12
mg_updatedOn: 2026-05-13T12:02:12

OncoLifeS OncoLifeS OncoLifeS Lung oncology Adult (18+ years)
type: Subpopulation counts
type: Observation
endpoint URL: catalogue_rdf
data set: Subpopulation counts
resource: OncoLifeS
subpopulation: OncoLifeS OncoLifeS Lung oncology
age group: http://umcgresearchdatacatalogue.nl/CatalogueOntologies/api/rdf/AgeGroups/name=Adult%20%2818%2B%20years%29
N total: 1320
N female: 580
N male: 740
mg_insertedOn: 2026-05-13T12:02:12
mg_updatedOn: 2026-05-13T12:02:12

OncoLifeS OncoLifeS OncoLifeS Head&Neck cancer Adult (18+ years)
type: Subpopulation counts
type: Observation
endpoint URL: catalogue_rdf
data set: Subpopulation counts
resource: OncoLifeS
subpopulation: OncoLifeS OncoLifeS Head&Neck cancer
age group: http://umcgresearchdatacatalogue.nl/CatalogueOntologies/api/rdf/AgeGroups/name=Adult%20%2818%2B%20years%29
N total: 2485
N female: 785
N male: 1700
mg_insertedOn: 2026-05-13T12:02:12
mg_updatedOn: 2026-05-13T12:02:12

OncoLifeS OncoLifeS OncoLifeS Hereditary Breast and Ovarian Cancer Adult (18+ years)
type: Subpopulation counts
type: Observation
endpoint URL: catalogue_rdf
data set: Subpopulation counts
resource: OncoLifeS
subpopulation: OncoLifeS OncoLifeS Hereditary Breast and Ovarian Cancer
age group: http://umcgresearchdatacatalogue.nl/CatalogueOntologies/api/rdf/AgeGroups/name=Adult%20%2818%2B%20years%29
N female: 255
mg_insertedOn: 2026-05-13T12:02:12
mg_updatedOn: 2026-05-13T12:02:12

OncoLifeS OncoLifeS OncoLifeS Hereditary Breast and Ovarian Cancer (historical) Adult (18+ years)
type: Subpopulation counts
type: Observation
endpoint URL: catalogue_rdf
data set: Subpopulation counts
resource: OncoLifeS
subpopulation: OncoLifeS OncoLifeS Hereditary Breast and Ovarian Cancer (historical)
age group: http://umcgresearchdatacatalogue.nl/CatalogueOntologies/api/rdf/AgeGroups/name=Adult%20%2818%2B%20years%29
N total: 1400
N female: 1400
mg_insertedOn: 2026-05-13T12:02:12
mg_updatedOn: 2026-05-13T12:02:12

OncoLifeS OncoLifeS OncoLifeS Bone and soft-tissue oncology Adult (18+ years)
type: Subpopulation counts
type: Observation
endpoint URL: catalogue_rdf
data set: Subpopulation counts
resource: OncoLifeS
subpopulation: OncoLifeS OncoLifeS Bone and soft-tissue oncology
age group: http://umcgresearchdatacatalogue.nl/CatalogueOntologies/api/rdf/AgeGroups/name=Adult%20%2818%2B%20years%29
N total: 235
N female: 110
N male: 125
mg_insertedOn: 2026-05-13T12:02:12
mg_updatedOn: 2026-05-13T12:02:12

OncoLifeS OncoLifeS OncoLifeS Anaplastic thyroid carcinoma Adult (18+ years)
type: Subpopulation counts
type: Observation
endpoint URL: catalogue_rdf
data set: Subpopulation counts
resource: OncoLifeS
subpopulation: OncoLifeS OncoLifeS Anaplastic thyroid carcinoma
age group: http://umcgresearchdatacatalogue.nl/CatalogueOntologies/api/rdf/AgeGroups/name=Adult%20%2818%2B%20years%29
N total: 20
N female: 10
N male: 10
mg_insertedOn: 2026-05-13T12:02:12
mg_updatedOn: 2026-05-13T12:02:12

OncoLifeS OncoLifeS OncoLifeS Gynecological oncology Adult (18+ years)
type: Subpopulation counts
type: Observation
endpoint URL: catalogue_rdf
data set: Subpopulation counts
resource: OncoLifeS
subpopulation: OncoLifeS OncoLifeS Gynecological oncology
age group: http://umcgresearchdatacatalogue.nl/CatalogueOntologies/api/rdf/AgeGroups/name=Adult%20%2818%2B%20years%29
N total: 1685
N female: 1685
mg_insertedOn: 2026-05-13T12:02:12
mg_updatedOn: 2026-05-13T12:02:12

EGAS00001005189
type: Collections
type: Observation
type: Dataset
endpoint URL: catalogue_rdf
data set: Collections
hricore: true
id: EGAS00001005189
pid: https://metadata.ega-archive.org/studies/EGAS00001005189
title: Nasal DNA methylation at three CpG sites predicts childhood allergic disease
name: Nasal DNA methylation at three CpG sites predicts childhood allergic disease
type: http://umcgresearchdatacatalogue.nl/CatalogueOntologies/api/rdf/ResourceTypes/name=Cohort%20study
landing page: https://ega-archive.org/studies/EGAS00001005189
website: EGAS00001005189
description: We used machine learning models to systematically integrate large-scale multi-omics data from genomics, DNA methylation in blood, and nasal and environmental factors. We firstly evaluated the prediction power of each omics layer and identified that the prediction power was largely attributed to nasal methylation. We further built a prediction model based on only three nasal CpG sites that can predict childhood allergic disease.
keyword: allergy
keywords: allergy
keyword: nasal DNA methylation
keywords: nasal DNA methylation
collection events: EGAS00001005189 EGAS00001005189 PIAMA DNA methylation dataset
organisations involved: EGAS00001005189 UMCG
publisher: EGAS00001005189 UMCG
creator: EGAS00001005189 UMCG
people involved: EGAS00001005189 Judith M Vonk
access rights: http://umcgresearchdatacatalogue.nl/CatalogueOntologies/api/rdf/AccessRights/name=Non%20public
access rights: NON PUBLIC
publications: EGAS00001005189 https://doi.org/10.1016/j.pccm.2024.02.002
publications: EGAS00001005189 https://doi.org/10.1038/s41467-022-35088-6
theme: http://umcgresearchdatacatalogue.nl/CatalogueOntologies/api/rdf/Themes/name=Health
theme: HEAL
applicable legislation: http://umcgresearchdatacatalogue.nl/CatalogueOntologies/api/rdf/Legislations/name=Data%20Governance%20Act
applicable legislation: oj
mg_draft: false
mg_insertedOn: 2026-05-13T12:02:13
mg_updatedOn: 2026-05-13T12:02:13
mg_tableclass: catalogue_rdf.Collections

EGAS00001005027
type: Collections
type: Observation
type: Dataset
endpoint URL: catalogue_rdf
data set: Collections
hricore: true
id: EGAS00001005027
pid: https://metadata.ega-archive.org/studies/EGAS00001005027
title: The Dutch Microbiome Project: Defining the (un)healthy gut microbiome
name: The Dutch Microbiome Project: Defining the (un)healthy gut microbiome
type: http://umcgresearchdatacatalogue.nl/CatalogueOntologies/api/rdf/ResourceTypes/name=Cohort%20study
landing page: https://ega-archive.org/studies/EGAS00001005027
website: EGAS00001005027
description: The Dutch Microbiome Project (DMP) data includes raw data generated by shotgun metagenomic sequencing of faecal samples of 8,208 Dutch individuals, processed microbiome data analysed using Biobakery2 tools (including taxonomy, pathway, virulence factors and antibiotic resistance gene profiles), and basic phenotypes (age and sex, BMI). Data is made available in two randomly assigned batches to facilitate the data access and maintenance.
keyword: shotgun metagenomic sequencing
keywords: shotgun metagenomic sequencing
keyword: microbiome
keywords: microbiome
collection events: EGAS00001005027 EGAS00001005027 The Dutch Microbiome Project Batch 2
collection events: EGAS00001005027 EGAS00001005027 The Dutch Microbiome Project Batch 1
number of unique individuals: 8208
number of participants: 8208
countries: http://umcgresearchdatacatalogue.nl/CatalogueOntologies/api/rdf/Countries/name=Netherlands%20%28the%29
spatial: NLD
organisations involved: EGAS00001005027 UMCG
publisher: EGAS00001005027 UMCG
creator: EGAS00001005027 UMCG
people involved: EGAS00001005027 Lifelines Data Management
contact point: EGAS00001005027 Lifelines Data Management
access rights: http://umcgresearchdatacatalogue.nl/CatalogueOntologies/api/rdf/AccessRights/name=Non%20public
access rights: NON PUBLIC
data access conditions description: Access to this dataset requires a minimal access procedure (data access form at https://forms.gle/eHeBdXJMXbVvCJRc8 or email request to the data access committee (DAC) of this study, listed at DAC EGAC00001001996, https://ega-archive.org/dacs/EGAC00001001996). This access procedure is to ensure that the data is being requested for research/scientific purposes only and thus complies with the informed consent signed by Lifelines participants, which specifies that the collected data will not be used for commercial purposes. Submitted data access forms will be evaluated by the DAC and Lifelines, and a response to requests will be given within two weeks. For requests from verified academic parties, access will be given without further delay. For requests from commercial parties, Lifelines will perform a pre-DPIA (Data Privacy Impact Assessment) to assess the risks of the proposed processing of personal data (e.g. purpose, storage, access, archiving, etc.) with respect to the GDPR (EU privacy laws) subject rights. Based on the outcome of the pre-DPIA, Lifelines will decide whether sharing data with the commercial entity is allowed and/or whether additional measures have to be taken.
publications: EGAS00001005027 https://doi.org/10.3389/fcimb.2023.1202035
publications: EGAS00001005027 https://doi.org/10.1038/s41467-023-37396-x
publications: EGAS00001005027 https://doi.org/10.3389/fmicb.2023.1223120
publications: EGAS00001005027 https://doi.org/10.1038/s41586-023-06893-w
theme: http://umcgresearchdatacatalogue.nl/CatalogueOntologies/api/rdf/Themes/name=Health
theme: HEAL
applicable legislation: http://umcgresearchdatacatalogue.nl/CatalogueOntologies/api/rdf/Legislations/name=Data%20Governance%20Act
applicable legislation: oj
mg_draft: false
mg_insertedOn: 2026-05-13T12:02:13
mg_updatedOn: 2026-05-13T12:02:13
mg_tableclass: catalogue_rdf.Collections

EGAS00001002560
type: Collections
type: Observation
type: Dataset
endpoint URL: catalogue_rdf
data set: Collections
hricore: true
id: EGAS00001002560
pid: https://metadata.ega-archive.org/studies/EGAS00001002560
title: Single-cell RNA sequencing reveals cell-type specific eQTLs in peripheral blood mononuclear cells
name: Single-cell RNA sequencing reveals cell-type specific eQTLs in peripheral blood mononuclear cells
type: http://umcgresearchdatacatalogue.nl/CatalogueOntologies/api/rdf/ResourceTypes/name=Cohort%20study
landing page: https://ega-archive.org/studies/EGAS00001002560
website: EGAS00001002560
description: This proof-of-concept study shows that single-cell RNA sequencing in ~25,000 peripheral blood mononuclear cells (PBMCs) of 45 donors allows for the identification of cell type-specific cis expression quantitative trait loci effects (cis-eQTLs). Moreover, the significant top-eQTL effects show consistent allelic direction (94%) with previously published whole blood deepSAGE data. These cell type-specific eQTLs may give us additional insight into the downstream consequences of genetic risk factors for immune-mediated diseases.
keyword: PMBC
keywords: PMBC
keyword: cis-eQTLs
keywords: cis-eQTLs
keyword: single-cell RNA sequencing
keywords: single-cell RNA sequencing
collection events: EGAS00001002560 EGAS00001002560 LLDeep DAG2+ scRNA-seq in PBMCs
collection events: EGAS00001002560 EGAS00001002560 LLDeep DAG2+: scRNA-seq in PBMCs
organisations involved: EGAS00001002560 UMCG
publisher: EGAS00001002560 UMCG
creator: EGAS00001002560 UMCG
people involved: EGAS00001002560 Monique van der Wijst
contact point: EGAS00001002560 Monique van der Wijst
access rights: http://umcgresearchdatacatalogue.nl/CatalogueOntologies/api/rdf/AccessRights/name=Non%20public
access rights: NON PUBLIC
publications: EGAS00001002560 https://doi.org/10.1186/s13059-023-02897-x
publications: EGAS00001002560 https://doi.org/10.1101/gr.261115.120
publications: EGAS00001002560 https://doi.org/10.1038/s41588-018-0089-9
publications: EGAS00001002560 https://doi.org/10.1016/j.cels.2019.10.007
publications: EGAS00001002560 https://doi.org/10.1038/s41467-021-23196-8
theme: http://umcgresearchdatacatalogue.nl/CatalogueOntologies/api/rdf/Themes/name=Health
theme: HEAL
applicable legislation: http://umcgresearchdatacatalogue.nl/CatalogueOntologies/api/rdf/Legislations/name=Data%20Governance%20Act
applicable legislation: oj
mg_draft: false
mg_insertedOn: 2026-05-13T12:02:13
mg_updatedOn: 2026-05-13T12:02:13
mg_tableclass: catalogue_rdf.Collections

EGAS50000000133
type: Collections
type: Observation
type: Dataset
endpoint URL: catalogue_rdf
data set: Collections
hricore: true
id: EGAS50000000133
pid: https://metadata.ega-archive.org/studies/EGAS50000000133
title: Lifelines NEXT EGA datasets
name: Lifelines NEXT EGA datasets
type: http://umcgresearchdatacatalogue.nl/CatalogueOntologies/api/rdf/ResourceTypes/name=Cohort%20study
landing page: https://ega-archive.org/studies/EGAS50000000133
website: EGAS50000000133
description: The Lifelines-NEXT is a cohort of newborns followed up from birth up to the age of 1 year and later. The cohort includes approximately 1,500 newborns and their mothers from the 3 provinces of the Northern Netherlands.
keyword: newborns
keywords: newborns
keyword: mothers
keywords: mothers
keyword: Lifelines NEXT
keywords: Lifelines NEXT
collection events: EGAS50000000133 EGAS50000000133 Lifelines NEXT HMO Data
collection events: EGAS50000000133 EGAS50000000133 HMO-microbiome study dataset, 16S sequencing
collection events: EGAS50000000133 EGAS50000000133 Lifelines NEXT 16S v3-v4 amplicon sequencing
collection events: EGAS50000000133 EGAS50000000133 Lifelines NEXT 16S-ITS-23S long read sequencing
countries: http://umcgresearchdatacatalogue.nl/CatalogueOntologies/api/rdf/Countries/name=Netherlands%20%28the%29
spatial: NLD
regions: http://umcgresearchdatacatalogue.nl/CatalogueOntologies/api/rdf/Regions/name=Drenthe
regions: http://umcgresearchdatacatalogue.nl/CatalogueOntologies/api/rdf/Regions/name=Groningen
regions: http://umcgresearchdatacatalogue.nl/CatalogueOntologies/api/rdf/Regions/name=Friesland
spatial: http://umcgresearchdatacatalogue.nl/CatalogueOntologies/api/rdf/Regions/name=Drenthe
spatial: http://umcgresearchdatacatalogue.nl/CatalogueOntologies/api/rdf/Regions/name=Groningen
spatial: http://umcgresearchdatacatalogue.nl/CatalogueOntologies/api/rdf/Regions/name=Friesland
organisations involved: EGAS50000000133 UMCG
publisher: EGAS50000000133 UMCG
creator: EGAS50000000133 UMCG
access rights: http://umcgresearchdatacatalogue.nl/CatalogueOntologies/api/rdf/AccessRights/name=Non%20public
access rights: NON PUBLIC
publications: EGAS50000000133 https://doi.org/10.1007/s10654-020-00614-7
theme: http://umcgresearchdatacatalogue.nl/CatalogueOntologies/api/rdf/Themes/name=Health
theme: HEAL
applicable legislation: http://umcgresearchdatacatalogue.nl/CatalogueOntologies/api/rdf/Legislations/name=Data%20Governance%20Act
applicable legislation: oj
mg_draft: false
mg_insertedOn: 2026-05-13T12:02:13
mg_updatedOn: 2026-05-13T12:02:13
mg_tableclass: catalogue_rdf.Collections

PSI IBD
type: Collections
type: Observation
type: Dataset
endpoint URL: catalogue_rdf
data set: Collections
hricore: true
id: PSI IBD
pid: https://doi.org/10.34760/5f5b80549e891
title: Parelsnoer Inflammatoire Darmziekten
name: Parelsnoer Inflammatoire Darmziekten
alternative: Parelsnoer IBD
acronym: Parelsnoer IBD
type: http://umcgresearchdatacatalogue.nl/CatalogueOntologies/api/rdf/ResourceTypes/name=Biobank
type: http://umcgresearchdatacatalogue.nl/CatalogueOntologies/api/rdf/ResourceTypes/name=Cohort%20study
cohort type: http://umcgresearchdatacatalogue.nl/CatalogueOntologies/api/rdf/CohortStudyTypes/name=Clinical%20cohort
landing page: https://www.umcg.nl/-/afdeling/ibd-centrum/wetenschappelijk-onderzoek
website: wetenschappelijk-onderzoek
description: National biobank to facilitate clinically relevant multi-omics research in patients with IBD. Inflammatory Bowel Diseases (IBD) are diseases characterized by inflammation of the gastrointestinal tract, including Crohn’s disease and ulcerative colitis. Its prevalence is rising, affecting approximately 100.000 persons in the Netherland alone. Its cause is multifactorial, involving a complex interplay between host genetics, environmental factors including the diet and dysregulated immune responses towards the gut microbiome Our aims - To further knowledge of the complex etiology of development and course of IBD - To search for predictors of treatment response - To use multi-omics data research of large groups of patients and translate its findings to personalized treatment of individual patients
keyword: IBD Crohn's disease
keywords: IBD Crohn's disease
keyword: Genome
keywords: Genome
keyword: Exposome
keywords: Exposome
keyword: Multiomics
keywords: Multiomics
keyword: Ulcerative colitis
keywords: Ulcerative colitis
keyword: Microbiome
keywords: Microbiome
keyword: IBD-undetermined
keywords: IBD-undetermined
keyword: Inflammatory Bowel Disease
keywords: Inflammatory Bowel Disease
start date: 2009
start year: 2009
design: http://umcgresearchdatacatalogue.nl/CatalogueOntologies/api/rdf/CohortDesigns/name=Longitudinal
provenance: Prospective cohort and biobank, including patients treated for their IBD at participating university hospitals in the Netherlands, and the UMCG especially.
design description: Prospective cohort and biobank, including patients treated for their IBD at participating university hospitals in the Netherlands, and the UMCG especially.
data collection type: http://umcgresearchdatacatalogue.nl/CatalogueOntologies/api/rdf/CohortCollectionTypes/name=Prospective
subpopulations: PSI IBD PSI IBD
collection events: PSI IBD PSI IBD Microbiome
collection events: PSI IBD PSI IBD Clinical data
collection events: PSI IBD PSI IBD Diet
collection events: PSI IBD PSI IBD Exposome
collection events: PSI IBD PSI IBD Biomaterial
collection events: PSI IBD PSI IBD Genome
number of unique individuals: 1200
number of participants: 1200
number of participants with samples: 1200
countries: http://umcgresearchdatacatalogue.nl/CatalogueOntologies/api/rdf/Countries/name=Netherlands%20%28the%29
spatial: NLD
population age groups: http://umcgresearchdatacatalogue.nl/CatalogueOntologies/api/rdf/AgeGroups/name=Aged%20%2880%2B%20years%29
population age groups: http://umcgresearchdatacatalogue.nl/CatalogueOntologies/api/rdf/AgeGroups/name=Aged%20%2865%2B%20years%29
population age groups: http://umcgresearchdatacatalogue.nl/CatalogueOntologies/api/rdf/AgeGroups/name=Middle-aged%20%2845-64%20years%29
population age groups: http://umcgresearchdatacatalogue.nl/CatalogueOntologies/api/rdf/AgeGroups/name=Adult%20%2818%2B%20years%29
population age groups: http://umcgresearchdatacatalogue.nl/CatalogueOntologies/api/rdf/AgeGroups/name=Young%20adult%20%2818-24%20years%29
population age groups: http://umcgresearchdatacatalogue.nl/CatalogueOntologies/api/rdf/AgeGroups/name=Adult%20%2825-44%20years%29
population age groups: http://umcgresearchdatacatalogue.nl/CatalogueOntologies/api/rdf/AgeGroups/name=Aged%20%2865-79%20years%29
other inclusion criteria: Patients are eligible for participation if: - ≥18 years old - Confirmed IBD diagnosis according to the applicable guidelines at time of diagnosis - Capable of will and knowledgeable in the Dutch language
organisations involved: PSI IBD ICC
organisations involved: PSI IBD UMCG
organisations involved: PSI IBD HealthRI
publisher: PSI IBD UMCG
creator: PSI IBD ICC
creator: PSI IBD UMCG
creator: PSI IBD HealthRI
people involved: PSI IBD Kim Sloot
contact point: PSI IBD Kim Sloot
linkage options: PALGA, Lifelines
access rights: http://umcgresearchdatacatalogue.nl/CatalogueOntologies/api/rdf/AccessRights/name=Non%20public
access rights: NON PUBLIC
data access conditions: http://umcgresearchdatacatalogue.nl/CatalogueOntologies/api/rdf/DataAccessConditions/name=no%20restriction
data use conditions: http://umcgresearchdatacatalogue.nl/CatalogueOntologies/api/rdf/DataUseConditions/name=ethics%20approval%20required
data use conditions: http://umcgresearchdatacatalogue.nl/CatalogueOntologies/api/rdf/DataUseConditions/name=collaboration%20required
data access fee: false
publications: PSI IBD https://doi.org/10.1136/bmjopen-2017-016695
publications: PSI IBD https://doi.org/10.1186/s12876-018-0917-5
theme: http://umcgresearchdatacatalogue.nl/CatalogueOntologies/api/rdf/Themes/name=Health

EGAS00001007054
type: Collections
type: Observation
type: Dataset
endpoint URL: catalogue_rdf
data set: Collections
hricore: true
id: EGAS00001007054
pid: https://metadata.ega-archive.org/studies/EGAS00001007054
title: PhIP-Seq data
name: PhIP-Seq data
type: http://umcgresearchdatacatalogue.nl/CatalogueOntologies/api/rdf/ResourceTypes/name=Cohort%20study
landing page: https://ega-archive.org/studies/EGAS00001007054
website: EGAS00001007054
description: Inflammatory bowel diseases (IBD), e.g. Crohn’s disease (CD) and ulcerative colitis (UC), are chronic immune-mediated inflammatory diseases. A comprehensive overview of an IBD-specific antibody epitope repertoire is, however, lacking. We leveraged a high-throughput phage-displayed immunoprecipitation sequencing (PhIP-seq) workflow to identify antibodies against 344,000 antimicrobial, immune and food antigens in 497 IBD patients.
keyword: Crohn's disease
keywords: Crohn's disease
keyword: ulcerative collitis
keywords: ulcerative collitis
keyword: IBD
keywords: IBD
collection events: EGAS00001007054 EGAS00001007054 PhIP-Seq Serum 1000IBD
number of unique individuals: 497
number of participants: 497
countries: http://umcgresearchdatacatalogue.nl/CatalogueOntologies/api/rdf/Countries/name=Netherlands%20%28the%29
spatial: NLD
organisations involved: EGAS00001007054 UMCG
publisher: EGAS00001007054 UMCG
creator: EGAS00001007054 UMCG
people involved: EGAS00001007054 Wieke Holwerda Holwerda
access rights: http://umcgresearchdatacatalogue.nl/CatalogueOntologies/api/rdf/AccessRights/name=Non%20public
access rights: NON PUBLIC
publications: EGAS00001007054 https://doi.org/10.1186/s40168-024-01858-1
theme: http://umcgresearchdatacatalogue.nl/CatalogueOntologies/api/rdf/Themes/name=Health
theme: HEAL
applicable legislation: http://umcgresearchdatacatalogue.nl/CatalogueOntologies/api/rdf/Legislations/name=Data%20Governance%20Act
applicable legislation: oj
mg_draft: false
mg_insertedOn: 2026-05-13T12:02:13
mg_updatedOn: 2026-05-13T12:02:13
mg_tableclass: catalogue_rdf.Collections

OncoLifeS
type: Collections
type: Observation
type: Dataset
endpoint URL: catalogue_rdf
data set: Collections
hricore: true
id: OncoLifeS
pid: https://doi.org/10.34760/5f5b7ff62dd52
title: Oncology Life Study
name: Oncology Life Study
alternative: OncoLifeS
acronym: OncoLifeS
type: http://umcgresearchdatacatalogue.nl/CatalogueOntologies/api/rdf/ResourceTypes/name=Biobank
landing page: https://umcgresearch.org/w/oncolifes
website: oncolifes
description: We have established a hospital-based data-biobank, entitled OncoLifeS (Oncological Life Study: Living well as a cancer survivor) to link routinely collected clinical data with preserved biological specimens and quality of life assessments. The OncoLifeS data-biobank has been designed to facilitate cancer research by providing clear phenotypic and genotypic data in a clinical context. Observational study involves collecting routine clinical data about carefully selected patient groups, and this can be combined with genetics and omics data from biological specimens. Indeed, understanding cancer heterogeneity, its temporal evolution over time, and the outcomes of guided treatment depend on accurate data about patient characteristics and their clinical management. Linking these routine clinical data to preserved biological specimens can then enable reproducible research capable of discovering biomarkers of cancer and/or treatment response, evaluating personalized treatment approaches, and increasing patient awareness. Including quality of life assessments may provide relevant information on how cancer and its treatment affects the subjective well-being of patients.
keyword: Oncology Surgery
keywords: Oncology Surgery
keyword: Biomaterial processing
keywords: Biomaterial processing
keyword: Dermatological cancer
keywords: Dermatological cancer
keyword: Long-term outcome data
keywords: Long-term outcome data
keyword: Patient characteristics
keywords: Patient characteristics
keyword: Quality of life data
keywords: Quality of life data
keyword: lung oncology
keywords: lung oncology
keyword: Patient reported data
keywords: Patient reported data
keyword: Treatment response
keywords: Treatment response
keyword: Cancer Research Centre
keywords: Cancer Research Centre
keyword: Adolescents and young adults with cancer
keywords: Adolescents and young adults with cancer
keyword: Hereditary increased risk of breast and ovarian cancer
keywords: Hereditary increased risk of breast and ovarian cancer
keyword: Neuroendocrine tumors
keywords: Neuroendocrine tumors
keyword: Imaging data
keywords: Imaging data
keyword: Dutch Trial Register
keywords: Dutch Trial Register
keyword: gynecological oncology
keywords: gynecological oncology
keyword: Quality of care
keywords: Quality of care
keyword: Quality of life
keywords: Quality of life
keyword: European reference network on rare cancers (EURACAN)
keywords: European reference network on rare cancers (EURACAN)
keyword: Translational research
keywords: Translational research
keyword: Patient-reported data
keywords: Patient-reported data
keyword: Testicular germ-cell tumors
keywords: Testicular germ-cell tumors
keyword: Breast cancer
keywords: Breast cancer
keyword: cancer patient
keywords: cancer patient
keyword: Tumor working groups
keywords: Tumor working groups
keyword: Data protection
keywords: Data protection
keyword: Longitudinal
keywords: Longitudinal
keyword: Data collection
keywords: Data collection
keyword: Age-related disease
keywords: Age-related disease
keyword: Sarcoma
keywords: Sarcoma
keyword: Imaging data handling
keywords: Imaging data handling
keyword: Bone and soft tissue cancer

EGAS00001006999
type: Collections
type: Observation
type: Dataset
endpoint URL: catalogue_rdf
data set: Collections
hricore: true
id: EGAS00001006999
pid: https://metadata.ega-archive.org/studies/EGAS00001006999
title: PhIP-Seq LLD
name: PhIP-Seq LLD
type: http://umcgresearchdatacatalogue.nl/CatalogueOntologies/api/rdf/ResourceTypes/name=Cohort%20study
landing page: https://ega-archive.org/studies/EGAS00001006999
website: EGAS00001006999
description: Bacteriophage Immunoprecipitation Sequencing (PhIP-Seq) of LLD participants. Libraries and protocol were developed in the Weizmann Institute of Science. Two different libraries were used, containing microbial and other immunological peptides respectively.
keyword: PhIP-Seq
keywords: PhIP-Seq
keyword: Lifelines Deep
keywords: Lifelines Deep
collection events: EGAS00001006999 EGAS00001006999 LLD PhIPSeq
organisations involved: EGAS00001006999 UMCG
publisher: EGAS00001006999 UMCG
creator: EGAS00001006999 UMCG
people involved: EGAS00001006999 Lifelines Data Management
contact point: EGAS00001006999 Lifelines Data Management
access rights: http://umcgresearchdatacatalogue.nl/CatalogueOntologies/api/rdf/AccessRights/name=Non%20public
access rights: NON PUBLIC
publications: EGAS00001006999 https://doi.org/10.1186/s40168-024-01858-1
theme: http://umcgresearchdatacatalogue.nl/CatalogueOntologies/api/rdf/Themes/name=Health
theme: HEAL
applicable legislation: http://umcgresearchdatacatalogue.nl/CatalogueOntologies/api/rdf/Legislations/name=Data%20Governance%20Act
applicable legislation: oj
mg_draft: false
mg_insertedOn: 2026-05-13T12:02:13
mg_updatedOn: 2026-05-13T12:02:13
mg_tableclass: catalogue_rdf.Collections

EGAS00001005376
type: Collections
type: Observation
type: Dataset
endpoint URL: catalogue_rdf
data set: Collections
hricore: true
id: EGAS00001005376
pid: https://metadata.ega-archive.org/studies/EGAS00001005376
title: Single-cell RNA sequencing dissects gene-environment interactions on gene expression and regulation in immune cells.
name: Single-cell RNA sequencing dissects gene-environment interactions on gene expression and regulation in immune cells.
type: http://umcgresearchdatacatalogue.nl/CatalogueOntologies/api/rdf/ResourceTypes/name=Cohort%20study
landing page: https://ega-archive.org/studies/EGAS00001005376
website: EGAS00001005376
description: This study aims to dissect gene-environment interactions on gene expression and regulation in immune cells using scRNA-seq data from 120 donors being stimulated with 3 pathogens, for 2 different timepoints. More specifically, we identified context- and cell-type-specific eQTLs and co-expression QTLs in PBMCs.
keyword: PMBC
keywords: PMBC
keyword: eQTL
keywords: eQTL
keyword: co-expression QTLs
keywords: co-expression QTLs
collection events: EGAS00001005376 EGAS00001005376 1M-scBloodNL
organisations involved: EGAS00001005376 UMCG
publisher: EGAS00001005376 UMCG
creator: EGAS00001005376 UMCG
people involved: EGAS00001005376 Monique van der Wijst
contact point: EGAS00001005376 Monique van der Wijst
access rights: http://umcgresearchdatacatalogue.nl/CatalogueOntologies/api/rdf/AccessRights/name=Non%20public
access rights: NON PUBLIC
publications: EGAS00001005376 https://doi.org/10.1038/s42003-022-03521-7
publications: EGAS00001005376 https://doi.org/10.1186/s13059-023-02897-x
publications: EGAS00001005376 https://doi.org/10.1038/s41467-022-30893-5
theme: http://umcgresearchdatacatalogue.nl/CatalogueOntologies/api/rdf/Themes/name=Health
theme: HEAL
applicable legislation: http://umcgresearchdatacatalogue.nl/CatalogueOntologies/api/rdf/Legislations/name=Data%20Governance%20Act
applicable legislation: oj
mg_draft: false
mg_insertedOn: 2026-05-13T12:02:13
mg_updatedOn: 2026-05-13T12:02:13
mg_tableclass: catalogue_rdf.Collections

EGAS00001000644
type: Collections
type: Observation
type: Dataset
endpoint URL: catalogue_rdf
data set: Collections
hricore: true
id: EGAS00001000644
pid: https://metadata.ega-archive.org/studies/EGAS00001000644
title: Genome of the Netherlands
name: Genome of the Netherlands
type: http://umcgresearchdatacatalogue.nl/CatalogueOntologies/api/rdf/ResourceTypes/name=Cohort%20study
landing page: https://ega-archive.org/studies/EGAS00001000644
website: EGAS00001000644
description: The Genome of the Netherlands (GoNL) Project characterizes DNA sequence variation, common and rare, for SNVs, short insertions and deletions (indels) and larger deletions in 769 individuals of Dutch ancestry selected from five biobanks under the auspices of the Dutch hub of the Biobanking and Biomolecular Research Infrastructure (BBMRI-NL). The samples come from a representative sample of 250 trio-families from all provinces in the Netherlands. The parent-offspring trios include adult individuals ranging in age from 19 to 87 years (mean=53 years; SD=16 years) from birth cohorts 1910-1994. Sequencing was done on blood-derived DNA from uncultured cells and accomplished coverage was 14-15x. Samples where contributed by LifeLines (http://lifelines.nl/lifelines-research/general), The Leiden Longevity Study (http://www.healthy-ageing.nl; http://www.langleven.net), The Netherlands Twin Registry (NTR: http://www.tweelingenregister. org), The Rotterdam studies, (http://www.erasmus-epidemiology.nl/rotterdamstudy) and the Genetic Research in Isolated Populations program (http://www.epib.nl/research/geneticepi/research.html#gip). The sequencing was carried out in collaboration with the Beijing Institute for Genomics (BGI). The analysis was done by a consortium lead by UMCG, LUMC, Erasmus MC, VU university and UMCU, see http://www.nlgenome.nl. Funding for the project was provided by the Netherlands Organization for Scientific Research under award number 184021007, dated July 9, 2009 and made available as a Rainbow Project of the Biobanking and Biomolecular Research Infrastructure Netherlands (BBMRI-NL).
keyword: DNA sequence variation
keywords: DNA sequence variation
collection events: EGAS00001000644 EGAS00001000644 GoNL aligned sequence data in BAM format.
collection events: EGAS00001000644 EGAS00001000644 GoNL release 5 raw SNV calls
collection events: EGAS00001000644 EGAS00001000644 GoNL release 5 haplotype panel
collection events: EGAS00001000644 EGAS00001000644 GoNL raw sequence data in fastq format
collection events: EGAS00001000644 EGAS00001000644 Set of Structural Variants and Indels for GoNL samples
part of networks: UMCG
organisations involved: EGAS00001000644 UMCG
publisher: EGAS00001000644 UMCG
creator: EGAS00001000644 UMCG
people involved: EGAS00001000644 Gert-Jan van de Geijn
contact point: EGAS00001000644 Gert-Jan van de Geijn
access rights: http://umcgresearchdatacatalogue.nl/CatalogueOntologies/api/rdf/AccessRights/name=Non%20public
access rights: NON PUBLIC
publications: EGAS00001000644 https://doi.org/10.1186/s12864-018-4482-7
publications: EGAS00001000644 https://doi.org/10.1038/ncomms12989
publications: EGAS00001000644 https://doi.org/10.1038/ejhg.2014.19
publications: EGAS00001000644 https://doi.org/10.1186/s12915-019-0674-0
publications: EGAS00001000644 https://doi.org/10.1038/ng.3021
publications: EGAS00001000644 https://doi.org/10.1038/ng.3292
publications: EGAS00001000644 https://doi.org/10.1101/gr.203216.115
publications: EGAS00001000644 https://doi.org/10.1038/s41598-019-55109-7
publications: EGAS00001000644 https://doi.org/10.1038/ejhg.2013.118
publications: EGAS00001000644 https://doi.org/10.1101/gr.185041.114
theme: http://umcgresearchdatacatalogue.nl/CatalogueOntologies/api/rdf/Themes/name=Health
theme: HEAL
applicable legislation: http://umcgresearchdatacatalogue.nl/CatalogueOntologies/api/rdf/Legislations/name=Data%20Governance%20Act
applicable legislation: oj
mg_draft: false
mg_insertedOn: 2026-05-13T12:02:13
mg_updatedOn: 2026-05-13T12:02:13
mg_tableclass: catalogue_rdf.Collections

EGAS00001006657
type: Collections
type: Observation
type: Dataset
endpoint URL: catalogue_rdf
data set: Collections
hricore: true
id: EGAS00001006657
pid: https://metadata.ega-archive.org/studies/EGAS00001006657
title: Nasal brushes analysis
name: Nasal brushes analysis
type: http://umcgresearchdatacatalogue.nl/CatalogueOntologies/api/rdf/ResourceTypes/name=Cohort%20study
landing page: https://ega-archive.org/studies/EGAS00001006657
website: EGAS00001006657
description: scRNA-seq samples from healthy and asthma donors part 1.
keyword: single cell RNAseq
keywords: single cell RNAseq
keyword: asthma
keywords: asthma
collection events: EGAS00001006657 EGAS00001006657 ORIENT study
organisations involved: EGAS00001006657 UMCG
publisher: EGAS00001006657 UMCG
creator: EGAS00001006657 UMCG
people involved: EGAS00001006657 Maarten van den Berge
access rights: http://umcgresearchdatacatalogue.nl/CatalogueOntologies/api/rdf/AccessRights/name=Non%20public
access rights: NON PUBLIC
publications: EGAS00001006657 https://doi.org/10.1038/s41467-022-35088-6
theme: http://umcgresearchdatacatalogue.nl/CatalogueOntologies/api/rdf/Themes/name=Health
theme: HEAL
applicable legislation: http://umcgresearchdatacatalogue.nl/CatalogueOntologies/api/rdf/Legislations/name=Data%20Governance%20Act
applicable legislation: oj
mg_draft: false
mg_insertedOn: 2026-05-13T12:02:13
mg_updatedOn: 2026-05-13T12:02:13
mg_tableclass: catalogue_rdf.Collections

EGAS00001002169
type: Collections
type: Observation
type: Dataset
endpoint URL: catalogue_rdf
data set: Collections
hricore: true
id: EGAS00001002169
pid: https://metadata.ega-archive.org/studies/EGAS00001002169
title: MeDALL epigenetics study
name: MeDALL epigenetics study
type: http://umcgresearchdatacatalogue.nl/CatalogueOntologies/api/rdf/ResourceTypes/name=Cohort%20study
landing page: https://ega-archive.org/studies/EGAS00001002169
website: EGAS00001002169
description: MeDALL- (Mechanisms of the Development of ALLergy) is a collaborative project supported by the European Union under the Health Cooperation Work Programme of the 7th Framework programme (grant agreement number 261357).MeDALL epigenetics study includes illumina 450k methylation measurements from 4 cohorts: Infancia y Medio Ambiente (INMA), Etudes des Déterminants pré et postnatals précoces du développement et de la santé de l’ENfant (EDEN), Children’s Allergy Environment Stockholm Epidemiology study(BAMSE), and Prevention and Incidence of Asthma and Mite Allergy (PIAMA)
keyword: multi-cohort study
keywords: multi-cohort study
keyword: allergy
keywords: allergy
collection events: EGAS00001002169 EGAS00001002169 MeDALL epigenetics data
organisations involved: EGAS00001002169 UMCG
publisher: EGAS00001002169 UMCG
creator: EGAS00001002169 UMCG
access rights: http://umcgresearchdatacatalogue.nl/CatalogueOntologies/api/rdf/AccessRights/name=Non%20public
access rights: NON PUBLIC
publications: EGAS00001002169 https://doi.org/10.1186/s12864-016-3452-1
theme: http://umcgresearchdatacatalogue.nl/CatalogueOntologies/api/rdf/Themes/name=Health
theme: HEAL
applicable legislation: http://umcgresearchdatacatalogue.nl/CatalogueOntologies/api/rdf/Legislations/name=Data%20Governance%20Act
applicable legislation: oj
mg_draft: false
mg_insertedOn: 2026-05-13T12:02:13
mg_updatedOn: 2026-05-13T12:02:13
mg_tableclass: catalogue_rdf.Collections

EGAS00001006347
type: Collections
type: Observation
type: Dataset
endpoint URL: catalogue_rdf
data set: Collections
hricore: true
id: EGAS00001006347
pid: https://metadata.ega-archive.org/studies/EGAS00001006347
title: Single cell whole genome sequencing of high hyperdiploid acute lymphoblastic leukemia
name: Single cell whole genome sequencing of high hyperdiploid acute lymphoblastic leukemia
type: http://umcgresearchdatacatalogue.nl/CatalogueOntologies/api/rdf/ResourceTypes/name=Cohort%20study
landing page: https://ega-archive.org/studies/EGAS00001006347
website: EGAS00001006347
description: This dataset was collected from viable bone marrow cells obtained at diagnosis from nine patients with high hyperdiploid ALL and one normal bone marrow sample. All samples were subjected to low pass single cell whole genome sequencing with the median sequencing coverage of 0.02x. Single nuclei in G0/G1 phase were isolated using a fluorescence-activated cell sorting (FACS) cytometer. DNA libraries were constructed and associated next-generation sequencing was carried out by European Research Institute for the Biology of Ageing (ERIBA), University of Groningen, University Medical Center Groningen, Groningen, The Netherlands. Further details regarding the DNA libraries construction are available by Bos et. al., 2019 (https://link.springer.com/protocol/10.1007/978-1-4939-8931-7_15). The dataset has been used for copy number aberrations analysis.
keyword: single cell whole genome sequencing
keywords: single cell whole genome sequencing
keyword: bone marrow samples
keywords: bone marrow samples
keyword: high hyperdiploid ALL
keywords: high hyperdiploid ALL
collection events: EGAS00001006347 EGAS00001006347 High hyperdiploid ALL single cell whole genome sequencing
organisations involved: EGAS00001006347 UMCG
publisher: EGAS00001006347 UMCG
creator: EGAS00001006347 UMCG
access rights: http://umcgresearchdatacatalogue.nl/CatalogueOntologies/api/rdf/AccessRights/name=Non%20public
access rights: NON PUBLIC
publications: EGAS00001006347 https://doi.org/10.1038/s41598-024-73743-8
publications: EGAS00001006347 https://doi.org/10.1038/s41467-023-37356-5
theme: http://umcgresearchdatacatalogue.nl/CatalogueOntologies/api/rdf/Themes/name=Health
theme: HEAL
applicable legislation: http://umcgresearchdatacatalogue.nl/CatalogueOntologies/api/rdf/Legislations/name=Data%20Governance%20Act
applicable legislation: oj
mg_draft: false
mg_insertedOn: 2026-05-13T12:02:13
mg_updatedOn: 2026-05-13T12:02:13
mg_tableclass: catalogue_rdf.Collections

EGAS00001003805
type: Collections
type: Observation
type: Dataset
endpoint URL: catalogue_rdf
data set: Collections
hricore: true
id: EGAS00001003805
pid: https://metadata.ega-archive.org/studies/EGAS00001003805
title: Celiac disease meta-analysis
name: Celiac disease meta-analysis
type: http://umcgresearchdatacatalogue.nl/CatalogueOntologies/api/rdf/ResourceTypes/name=Cohort%20study
landing page: https://ega-archive.org/studies/EGAS00001003805
website: EGAS00001003805
description: Celiac disease (CeD) is a common immune-mediated disease of the small intestine that is triggered by exposure to dietary gluten. While the HLA locus plays a major role in disease susceptibility, 39 non-HLA loci were also identified in a study of 24,269 individuals. We now build on this earlier study by adding 4,125 additional Caucasian samples including an Argentinian cohort genotyped on the Immunochip. In doing so, we not only confirm the previous associations, we also identify two novel independent genome-wide significant associations.
keyword: GWAS
keywords: GWAS
keyword: celiac disease
keywords: celiac disease
keyword: meta-analysis
keywords: meta-analysis
collection events: EGAS00001003805 EGAS00001003805 CeD_UnitedKingdom
collection events: EGAS00001003805 EGAS00001003805 CeD_Argentina_1
collection events: EGAS00001003805 EGAS00001003805 CeD_Poland
collection events: EGAS00001003805 EGAS00001003805 CeD_Argentina_2
collection events: EGAS00001003805 EGAS00001003805 CeD_Italy
collection events: EGAS00001003805 EGAS00001003805 CeD_Netherlands
collection events: EGAS00001003805 EGAS00001003805 CeD_meta_analysis
collection events: EGAS00001003805 EGAS00001003805 CeD_Spain
collection events: EGAS00001003805 EGAS00001003805 CeD_Ireland
organisations involved: EGAS00001003805 UMCG
publisher: EGAS00001003805 UMCG
creator: EGAS00001003805 UMCG
access rights: http://umcgresearchdatacatalogue.nl/CatalogueOntologies/api/rdf/AccessRights/name=Non%20public
access rights: NON PUBLIC
publications: EGAS00001003805 https://doi.org/10.1038/s41431-019-0520-4
publications: EGAS00001003805 https://doi.org/10.3389/fgene.2020.562434
theme: http://umcgresearchdatacatalogue.nl/CatalogueOntologies/api/rdf/Themes/name=Health
theme: HEAL
applicable legislation: http://umcgresearchdatacatalogue.nl/CatalogueOntologies/api/rdf/Legislations/name=Data%20Governance%20Act
applicable legislation: oj
mg_draft: false
mg_insertedOn: 2026-05-13T12:02:13
mg_updatedOn: 2026-05-13T12:02:13
mg_tableclass: catalogue_rdf.Collections

EGAS00001004766
type: Collections
type: Observation
type: Dataset
endpoint URL: catalogue_rdf
data set: Collections
hricore: true
id: EGAS00001004766
pid: https://metadata.ega-archive.org/studies/EGAS00001004766
title: Epigenome-wide association study of asthma remission in whole blood and nasal epithelium
name: Epigenome-wide association study of asthma remission in whole blood and nasal epithelium
type: http://umcgresearchdatacatalogue.nl/CatalogueOntologies/api/rdf/ResourceTypes/name=Cohort%20study
landing page: https://ega-archive.org/studies/EGAS00001004766
website: EGAS00001004766
description: Asthma is a chronic respiratory disease which is not curable, yet some patients experience spontaneous remission.In this study, we hypothesized that epigenetic mechanisms may be involved in asthma remission.
keyword: asthma in remission
keywords: asthma in remission
keyword: epigenetics
keywords: epigenetics
keyword: asthma
keywords: asthma
collection events: EGAS00001004766 EGAS00001004766 Epigenome-wide association study of asthma remission in whole blood and nasal epithelium
organisations involved: EGAS00001004766 UMCG
publisher: EGAS00001004766 UMCG
creator: EGAS00001004766 UMCG
people involved: EGAS00001004766 Judith M Vonk
access rights: http://umcgresearchdatacatalogue.nl/CatalogueOntologies/api/rdf/AccessRights/name=Non%20public
access rights: NON PUBLIC
publications: EGAS00001004766 https://doi.org/10.1186/s13601-020-00365-4
theme: http://umcgresearchdatacatalogue.nl/CatalogueOntologies/api/rdf/Themes/name=Health
theme: HEAL
applicable legislation: http://umcgresearchdatacatalogue.nl/CatalogueOntologies/api/rdf/Legislations/name=Data%20Governance%20Act
applicable legislation: oj
mg_draft: false
mg_insertedOn: 2026-05-13T12:02:13
mg_updatedOn: 2026-05-13T12:02:13
mg_tableclass: catalogue_rdf.Collections

AHON
type: Collections
type: Observation
type: Dataset
endpoint URL: catalogue_rdf
data set: Collections
hricore: true
id: AHON
pid: https://doi.org/10.34760/6526614a5ef93
title: Academisch Huisarts Ontwikkel Netwerk
name: Academisch Huisarts Ontwikkel Netwerk
alternative: AHON
acronym: AHON
type: http://umcgresearchdatacatalogue.nl/CatalogueOntologies/api/rdf/ResourceTypes/name=Cohort%20study
cohort type: http://umcgresearchdatacatalogue.nl/CatalogueOntologies/api/rdf/CohortStudyTypes/name=Clinical%20cohort
cohort type: http://umcgresearchdatacatalogue.nl/CatalogueOntologies/api/rdf/CohortStudyTypes/name=Population%20cohort
landing page: https://www.umcg.nl/-/ahon
website: ahon
description: The Academic General Practitioner Network (AHON), part of the Department of Primary and Long-term Care of the University Medical Center Groningen (UMCG), manages the AHON-database that comprises routinely collected care data from affiliated registration practices in the North of the Netherlands. The design of the AHON-database allows researchers to use it for both cross-sectional and longitudinal research.
keyword: VCIR
keywords: VCIR
keyword: morbidity
keywords: morbidity
keyword: registry
keywords: registry
keyword: machine learning
keywords: machine learning
keyword: NHG
keywords: NHG
keyword: Natural Language Processing
keywords: Natural Language Processing
keyword: GP
keywords: GP
keyword: HIS
keywords: HIS
keyword: general practicioner
keywords: general practicioner
keyword: huisarts
keywords: huisarts
keyword: primary care
keywords: primary care
keyword: vrije teksten
keywords: vrije teksten
keyword: eerstelijnszorg
keywords: eerstelijnszorg
keyword: ATC
keywords: ATC
keyword: general practice
keywords: general practice
keyword: ICPC
keywords: ICPC
keyword: primary care data
keywords: primary care data
internal identifiers: AHON 202100077
internal identifiers: AHON 9694
start date: 1998
start year: 1998
design: http://umcgresearchdatacatalogue.nl/CatalogueOntologies/api/rdf/CohortDesigns/name=Longitudinal
data collection type: http://umcgresearchdatacatalogue.nl/CatalogueOntologies/api/rdf/CohortCollectionTypes/name=Retrospective
data collection type: http://umcgresearchdatacatalogue.nl/CatalogueOntologies/api/rdf/CohortCollectionTypes/name=Prospective
subpopulations: AHON AHON RNG
subpopulations: AHON AHON General population
collection events: AHON AHON Continuous collection
part of networks: UMCG
number of unique individuals: 600000
number of participants: 600000
countries: http://umcgresearchdatacatalogue.nl/CatalogueOntologies/api/rdf/Countries/name=Netherlands%20%28the%29
spatial: NLD
regions: http://umcgresearchdatacatalogue.nl/CatalogueOntologies/api/rdf/Regions/name=Overijssel
regions: http://umcgresearchdatacatalogue.nl/CatalogueOntologies/api/rdf/Regions/name=Drenthe
regions: http://umcgresearchdatacatalogue.nl/CatalogueOntologies/api/rdf/Regions/name=Groningen
regions: http://umcgresearchdatacatalogue.nl/CatalogueOntologies/api/rdf/Regions/name=Friesland
spatial: http://umcgresearchdatacatalogue.nl/CatalogueOntologies/api/rdf/Regions/name=Overijssel
spatial: http://umcgresearchdatacatalogue.nl/CatalogueOntologies/api/rdf/Regions/name=Drenthe
spatial: http://umcgresearchdatacatalogue.nl/CatalogueOntologies/api/rdf/Regions/name=Groningen
spatial: http://umcgresearchdatacatalogue.nl/CatalogueOntologies/api/rdf/Regions/name=Friesland
population age groups: http://umcgresearchdatacatalogue.nl/CatalogueOntologies/api/rdf/AgeGroups/name=Infants%20and%20toddlers%20%282-23%20months%29
population age groups: http://umcgresearchdatacatalogue.nl/CatalogueOntologies/api/rdf/AgeGroups/name=Adult%20%2818%2B%20years%29
population age groups: http://umcgresearchdatacatalogue.nl/CatalogueOntologies/api/rdf/AgeGroups/name=Adult%20%2825-44%20years%29
population age groups: http://umcgresearchdatacatalogue.nl/CatalogueOntologies/api/rdf/AgeGroups/name=Aged%20%2865%2B%20years%29

LIFELINES_NEXT
type: Collections
type: Observation
type: Dataset
endpoint URL: catalogue_rdf
data set: Collections
hricore: true
id: LIFELINES_NEXT
pid: https://doi.org/10.34760/652669f94ba18
title: Lifelines NEXT
name: Lifelines NEXT
alternative: LLNEXT
acronym: LLNEXT
type: http://umcgresearchdatacatalogue.nl/CatalogueOntologies/api/rdf/ResourceTypes/name=Biobank
type: http://umcgresearchdatacatalogue.nl/CatalogueOntologies/api/rdf/ResourceTypes/name=Cohort%20study
cohort type: http://umcgresearchdatacatalogue.nl/CatalogueOntologies/api/rdf/CohortStudyTypes/name=Birth%20cohort
cohort type: http://umcgresearchdatacatalogue.nl/CatalogueOntologies/api/rdf/CohortStudyTypes/name=Population%20cohort
landing page: https://www.lifelines.nl/next
website: next
description: Lifelines NEXT (LLNEXT) is a birth cohort designed to study the effects of intrinsic and extrinsic determinants on health and disease as epidemiological research has shown there is a strong relationship between pre-conceptional, prenatal, birth and early-life factors and lifelong health. It is embedded within the Lifelines cohort study, a prospective three-generation population-based cohort study recording the health and health-related aspects of 167,729 individuals living in Northern Netherlands. The nesting of the study within Lifelines enables us to include pre-conceptional transgenerational data which can be used to identify other factors that influence health in other families in a four-generation design. LLNEXT included 1.450 pregnant women and their children residing in the northern provinces of The Netherlands. The women are followed from the third month of their pregnancy. As of 2018, partners were also invited to enroll in LLNEXT. Standardized protocols and guidelines are available upon request.
keyword: Breast milk
keywords: Breast milk
keyword: Development
keywords: Development
keyword: Urine
keywords: Urine
keyword: Blood
keywords: Blood
keyword: Cord blood
keywords: Cord blood
keyword: Healthy ageing
keywords: Healthy ageing
keyword: Birth cohort
keywords: Birth cohort
keyword: Transgenerational effects
keywords: Transgenerational effects
keyword: Meconium
keywords: Meconium
keyword: Microbiome
keywords: Microbiome
keyword: Biobank
keywords: Biobank
keyword: Feces
keywords: Feces
internal identifiers: LIFELINES_NEXT 5470
internal identifiers: LIFELINES_NEXT 201501227
external identifiers: LIFELINES_NEXT METc2015/600
start date: 2016
start year: 2016
end date: 2025
end year: 2025
design: http://umcgresearchdatacatalogue.nl/CatalogueOntologies/api/rdf/CohortDesigns/name=Longitudinal
provenance: Upon giving informed concent, the LLNEXT participants are asked to fill in questionnaires and donate biomaterials at several time points during pregnacy, at birth and after delivery of themselves and their child.
design description: Upon giving informed concent, the LLNEXT participants are asked to fill in questionnaires and donate biomaterials at several time points during pregnacy, at birth and after delivery of themselves and their child.
data collection type: http://umcgresearchdatacatalogue.nl/CatalogueOntologies/api/rdf/CohortCollectionTypes/name=Prospective
subpopulations: LIFELINES_NEXT LIFELINES_NEXT Children
subpopulations: LIFELINES_NEXT LIFELINES_NEXT Partners
subpopulations: LIFELINES_NEXT LIFELINES_NEXT Mothers
collection events: LIFELINES_NEXT LIFELINES_NEXT M12
collection events: LIFELINES_NEXT LIFELINES_NEXT M2
collection events: LIFELINES_NEXT LIFELINES_NEXT M10
collection events: LIFELINES_NEXT LIFELINES_NEXT M9
collection events: LIFELINES_NEXT LIFELINES_NEXT Y5
collection events: LIFELINES_NEXT LIFELINES_NEXT M5
collection events: LIFELINES_NEXT LIFELINES_NEXT M3
collection events: LIFELINES_NEXT LIFELINES_NEXT W2
collection events: LIFELINES_NEXT LIFELINES_NEXT M1
collection events: LIFELINES_NEXT LIFELINES_NEXT P18
collection events: LIFELINES_NEXT LIFELINES_NEXT Y6
collection events: LIFELINES_NEXT LIFELINES_NEXT P12
collection events: LIFELINES_NEXT LIFELINES_NEXT Y2.5
collection events: LIFELINES_NEXT LIFELINES_NEXT P28
collection events: LIFELINES_NEXT LIFELINES_NEXT Y3.5
collection events: LIFELINES_NEXT LIFELINES_NEXT Y4.5
collection events: LIFELINES_NEXT LIFELINES_NEXT Y5.5
collection events: LIFELINES_NEXT LIFELINES_NEXT Y4
collection events: LIFELINES_NEXT LIFELINES_NEXT Y2
collection events: LIFELINES_NEXT LIFELINES_NEXT LLNEXT_Partners
collection events: LIFELINES_NEXT LIFELINES_NEXT P32
collection events: LIFELINES_NEXT LIFELINES_NEXT M11

Lifelines NEXT.png
type: SIO_000396
format: http://www.iana.org/assignments/media-types/image/png

20240318_LLNEXT_Collected materials_questionnaires.png
type: SIO_000396
format: http://www.iana.org/assignments/media-types/image/png

EGAS50000000483
type: Collections
type: Observation
type: Dataset
endpoint URL: catalogue_rdf
data set: Collections
hricore: true
id: EGAS50000000483
pid: https://metadata.ega-archive.org/studies/EGAS50000000483
title: Neoadjuvant immune checkpoint blockade in women with mismatch repair deficient endometrial cancer
name: Neoadjuvant immune checkpoint blockade in women with mismatch repair deficient endometrial cancer
type: http://umcgresearchdatacatalogue.nl/CatalogueOntologies/api/rdf/ResourceTypes/name=Cohort%20study
landing page: https://ega-archive.org/studies/EGAS50000000483
website: EGAS50000000483
description: Neoadjuvant immune checkpoint blockade (ICB) has shown unprecedented activity in mismatch repair deficient (MMRd) colorectal cancers, but its effectiveness in MMRd endometrial cancer (EC) remains unknown. In this investigator-driven, phase I, feasibility study (NCT04262089), 10 women with MMRd EC of any grade, planned for primary surgery, received two cycles of neoadjuvant pembrolizumab (200 mg IV) every three weeks. A pathologic response (primary objective) was observed in 5/10 patients, with 2 patients showing a major pathologic response. No patient achieved a complete pathologic response. A partial radiologic response (secondary objective) was observed in 3/10 patients, 5/10 patients had stable disease and 2/10 patients were non-evaluable on Magnetic Resonance Imaging (MRI). All patients completed treatment without severe toxicity (exploratory objective). At median duration of follow-up of 22.5 months, two non-responders experienced disease recurrence. In-depth analysis of the loco-regional and systemic immune response (predefined exploratory objective) showed that monoclonal T cell expansion significantly correlated with treatment response. Tumour-draining lymph nodes displayed clonal overlap with intra-tumoural T cell expansion. All pre-specified endpoints, efficacy in terms of pathologic response as primary endpoint, radiologic response as secondary outcome and safety and tolerability as exploratory endpoint, were reached. Neoadjuvant ICB with pembrolizumab proved safe and induced pathologic, radiologic, and immunologic responses in MMRd EC, warranting further exploration of extended neoadjuvant treatment.
keyword: mmRd
keywords: mmRd
keyword: endometrial cancer
keywords: endometrial cancer
collection events: EGAS50000000483 EGAS50000000483 Patient TSO500 VCF files
number of unique individuals: 10
number of participants: 10
number of participants with samples: 10
countries: http://umcgresearchdatacatalogue.nl/CatalogueOntologies/api/rdf/Countries/name=Netherlands%20%28the%29
spatial: NLD
organisations involved: EGAS50000000483 UMCG
publisher: EGAS50000000483 UMCG
creator: EGAS50000000483 UMCG
people involved: EGAS50000000483 Marco de Bruyn
contact point: EGAS50000000483 Marco de Bruyn
access rights: http://umcgresearchdatacatalogue.nl/CatalogueOntologies/api/rdf/AccessRights/name=Non%20public
access rights: NON PUBLIC
publications: EGAS50000000483 https://doi.org/10.1038/s41467-024-52098-8
theme: http://umcgresearchdatacatalogue.nl/CatalogueOntologies/api/rdf/Themes/name=Health
theme: HEAL
applicable legislation: http://umcgresearchdatacatalogue.nl/CatalogueOntologies/api/rdf/Legislations/name=Data%20Governance%20Act
applicable legislation: oj
mg_draft: false
mg_insertedOn: 2026-05-13T12:02:13
mg_updatedOn: 2026-05-13T12:02:13
mg_tableclass: catalogue_rdf.Collections

EGAS00001003735
type: Collections
type: Observation
type: Dataset
endpoint URL: catalogue_rdf
data set: Collections
hricore: true
id: EGAS00001003735
pid: https://metadata.ega-archive.org/studies/EGAS00001003735
title: Gene expression by RNAseq in bronchial biopsies of asthmatics, asthma in remission and healthy subjects
name: Gene expression by RNAseq in bronchial biopsies of asthmatics, asthma in remission and healthy subjects
type: http://umcgresearchdatacatalogue.nl/CatalogueOntologies/api/rdf/ResourceTypes/name=Cohort%20study
landing page: https://ega-archive.org/studies/EGAS00001003735
website: EGAS00001003735
description: The study focus was differential expression in bronchial biopsies between persistent asthma, asthma in remission and healthy controls using RNAseq.
keyword: bronchial biopsies
keywords: bronchial biopsies
keyword: RNAseq
keywords: RNAseq
keyword: asthma
keywords: asthma
collection events: EGAS00001003735 EGAS00001003735 Gene expression by RNAseq in bronchial biopsies of asthmatics, asthma in remission and healthy subjects
organisations involved: EGAS00001003735 UMCG
publisher: EGAS00001003735 UMCG
creator: EGAS00001003735 UMCG
people involved: EGAS00001003735 Maarten van den Berge
contact point: EGAS00001003735 Maarten van den Berge
access rights: http://umcgresearchdatacatalogue.nl/CatalogueOntologies/api/rdf/AccessRights/name=Non%20public
access rights: NON PUBLIC
publications: EGAS00001003735 https://doi.org/10.1038/s41598-020-74121-w
publications: EGAS00001003735 https://doi.org/10.1186/s12931-023-02430-5
publications: EGAS00001003735 https://doi.org/10.1111/cea.13732
theme: http://umcgresearchdatacatalogue.nl/CatalogueOntologies/api/rdf/Themes/name=Health
theme: HEAL
applicable legislation: http://umcgresearchdatacatalogue.nl/CatalogueOntologies/api/rdf/Legislations/name=Data%20Governance%20Act
applicable legislation: oj
mg_draft: false
mg_insertedOn: 2026-05-13T12:02:13
mg_updatedOn: 2026-05-13T12:02:13
mg_tableclass: catalogue_rdf.Collections

EGAS00001007450
type: Collections
type: Observation
type: Dataset
endpoint URL: catalogue_rdf
data set: Collections
hricore: true
id: EGAS00001007450
pid: https://metadata.ega-archive.org/studies/EGAS00001007450
title: RSV infection of primary bronchial epithelial cells in asthma
name: RSV infection of primary bronchial epithelial cells in asthma
type: http://umcgresearchdatacatalogue.nl/CatalogueOntologies/api/rdf/ResourceTypes/name=Cohort%20study
landing page: https://ega-archive.org/studies/EGAS00001007450
website: EGAS00001007450
description: Primary bronchial epithelial cells derived from healthy donors and asthma patients were differentiated in Air-Liquid-Interface condition and infected with the respiratory syncytial virus. Single-cell RNA sequencing analysis of these cultures was used to study the transcriptomic response of the cells to RSV.
keyword: scRNAseq
keywords: scRNAseq
keyword: asthma
keywords: asthma
keyword: respiratory syncytial virus
keywords: respiratory syncytial virus
collection events: EGAS00001007450 EGAS00001007450 scRNAseq data from ALI cultures of healthy donors and patients with asthma, infected with RSV
organisations involved: EGAS00001007450 UMCG
publisher: EGAS00001007450 UMCG
creator: EGAS00001007450 UMCG
access rights: http://umcgresearchdatacatalogue.nl/CatalogueOntologies/api/rdf/AccessRights/name=Non%20public
access rights: NON PUBLIC
publications: EGAS00001007450 https://doi.org/10.1136/thorax-2023-220230
theme: http://umcgresearchdatacatalogue.nl/CatalogueOntologies/api/rdf/Themes/name=Health
theme: HEAL
applicable legislation: http://umcgresearchdatacatalogue.nl/CatalogueOntologies/api/rdf/Legislations/name=Data%20Governance%20Act
applicable legislation: oj
mg_draft: false
mg_insertedOn: 2026-05-13T12:02:13
mg_updatedOn: 2026-05-13T12:02:13
mg_tableclass: catalogue_rdf.Collections

EGAS00001007571
type: Collections
type: Observation
type: Dataset
endpoint URL: catalogue_rdf
data set: Collections
hricore: true
id: EGAS00001007571
pid: https://metadata.ega-archive.org/studies/EGAS00001007571
title: CS Baby Biome
name: CS Baby Biome
type: http://umcgresearchdatacatalogue.nl/CatalogueOntologies/api/rdf/ResourceTypes/name=Cohort%20study
landing page: https://ega-archive.org/studies/EGAS00001007571
website: EGAS00001007571
description: CS Baby Biome randomized control trial aims to investigate if the timing of intrapartum antibiotics given to mother influences the infant gut microbiome composition. The study was performed in women delivering via elective CS, who received antibiotics prior to skin incision, or after umbilical cord clamping.
keyword: intrapartum antibiotics
keywords: intrapartum antibiotics
keyword: baby gut microbiome
keywords: baby gut microbiome
collection events: EGAS00001007571 EGAS00001007571 CS Baby Biome gut microbiome
organisations involved: EGAS00001007571 UMCG
publisher: EGAS00001007571 UMCG
creator: EGAS00001007571 UMCG
access rights: http://umcgresearchdatacatalogue.nl/CatalogueOntologies/api/rdf/AccessRights/name=Non%20public
access rights: NON PUBLIC
theme: http://umcgresearchdatacatalogue.nl/CatalogueOntologies/api/rdf/Themes/name=Health
theme: HEAL
applicable legislation: http://umcgresearchdatacatalogue.nl/CatalogueOntologies/api/rdf/Legislations/name=Data%20Governance%20Act
applicable legislation: oj
mg_draft: false
mg_insertedOn: 2026-05-13T12:02:13
mg_updatedOn: 2026-05-13T12:02:13
mg_tableclass: catalogue_rdf.Collections

AcuteLines
type: Collections
type: Observation
type: Dataset
endpoint URL: catalogue_rdf
data set: Collections
hricore: true
id: AcuteLines
pid: https://doi.org/10.34760/5f5b7d8a064c8
name: AcuteLines
alternative: AcuteLines
acronym: AcuteLines
type: http://umcgresearchdatacatalogue.nl/CatalogueOntologies/api/rdf/ResourceTypes/name=Biobank
type: http://umcgresearchdatacatalogue.nl/CatalogueOntologies/api/rdf/ResourceTypes/name=Cohort%20study
cohort type: http://umcgresearchdatacatalogue.nl/CatalogueOntologies/api/rdf/CohortStudyTypes/name=Clinical%20cohort
landing page: http://www.acutelines.com
website: www.acutelines.com
description: Research in acute care faces many challenges, including enrollment challenges, legal limitations in data sharing, limited funding, and lack of singular ownership of the domain of acute care. To overcome some of these challenges, the Center of Acute Care of the University Medical Center Groningen in the Netherlands, has established a de novo data-, image- and biobank named "Acutelines". Acutelines is initiated to improve recognition and treatment of acute diseases and obtain insight in the consequences of acute diseases, including factors predicting its outcome. Thereby, Acutelines contributes to development of personalized treatment and improves prediction of patient outcomes after an acute admission.
keyword: Emergencies
keywords: Emergencies
keyword: ECG
keywords: ECG
keyword: Acute Illness
keywords: Acute Illness
keyword: Metabolism
keywords: Metabolism
keyword: Precision Medicine
keywords: Precision Medicine
keyword: Skin Infection
keywords: Skin Infection
keyword: Urinary Tract Infections
keywords: Urinary Tract Infections
keyword: Hemorrhage
keywords: Hemorrhage
keyword: Microbiology
keywords: Microbiology
keyword: Acute Care
keywords: Acute Care
keyword: Emergency Medicine
keywords: Emergency Medicine
keyword: Shock
keywords: Shock
keyword: Internal Medicine
keywords: Internal Medicine
keyword: Rehospitalization
keywords: Rehospitalization
keyword: Illness Prediction
keywords: Illness Prediction
keyword: Acutelines
keywords: Acutelines
keyword: Urine
keywords: Urine
keyword: Acute Medicine
keywords: Acute Medicine
keyword: RNA
keywords: RNA
keyword: Virology
keywords: Virology
keyword: Intoxication By Drug
keywords: Intoxication By Drug
keyword: PAXGene
keywords: PAXGene
keyword: Transcriptomics
keywords: Transcriptomics
keyword: Septic Shock
keywords: Septic Shock
keyword: Proteome
keywords: Proteome
keyword: Quality Of Life
keywords: Quality Of Life
keyword: Easures
keywords: Easures
keyword: Personalized Medicine
keywords: Personalized Medicine
keyword: Genomics
keywords: Genomics
keyword: Patient Reported Outcome Measures
keywords: Patient Reported Outcome Measures
keyword: Microbiome
keywords: Microbiome

EGAS00001005225
type: Collections
type: Observation
type: Dataset
endpoint URL: catalogue_rdf
data set: Collections
hricore: true
id: EGAS00001005225
pid: https://metadata.ega-archive.org/studies/EGAS00001005225
title: Gluten-free microbiome study UMCG
name: Gluten-free microbiome study UMCG
type: http://umcgresearchdatacatalogue.nl/CatalogueOntologies/api/rdf/ResourceTypes/name=Cohort%20study
landing page: https://ega-archive.org/studies/EGAS00001005225
website: EGAS00001005225
description: Gluten-free diet intervention: 11 individuals, 3 time points (T1: 1 week before intervention, T2: at the intervention; T3: 5 weeks after intervention. Fecal samples taken at each time point were sujbject of VLP enrichment and routine metagenomics sequencing
keyword: fecal metagenomic libraries
keywords: fecal metagenomic libraries
collection events: EGAS00001005225 EGAS00001005225 GFD viral enrichment sequencing
collection events: EGAS00001005225 EGAS00001005225 GFD metagenomic sequencing
organisations involved: EGAS00001005225 UMCG
publisher: EGAS00001005225 UMCG
creator: EGAS00001005225 UMCG
access rights: http://umcgresearchdatacatalogue.nl/CatalogueOntologies/api/rdf/AccessRights/name=Non%20public
access rights: NON PUBLIC
theme: http://umcgresearchdatacatalogue.nl/CatalogueOntologies/api/rdf/Themes/name=Health
theme: HEAL
applicable legislation: http://umcgresearchdatacatalogue.nl/CatalogueOntologies/api/rdf/Legislations/name=Data%20Governance%20Act
applicable legislation: oj
mg_draft: false
mg_insertedOn: 2026-05-13T12:02:13
mg_updatedOn: 2026-05-13T12:02:13
mg_tableclass: catalogue_rdf.Collections

EGAS00001003739
type: Collections
type: Observation
type: Dataset
endpoint URL: catalogue_rdf
data set: Collections
hricore: true
id: EGAS00001003739
pid: https://metadata.ega-archive.org/studies/EGAS00001003739
title: DNA methylation in bronchial biopsies of asthmatics, asthma in remission and healthy subjects
name: DNA methylation in bronchial biopsies of asthmatics, asthma in remission and healthy subjects
type: http://umcgresearchdatacatalogue.nl/CatalogueOntologies/api/rdf/ResourceTypes/name=Cohort%20study
landing page: https://ega-archive.org/studies/EGAS00001003739
website: EGAS00001003739
description: The study focus was differential methylation in bronchial biopsies between persistent asthma, asthma in remission and healthy controls using Illumina 450k arrays.
keyword: methylation
keywords: methylation
keyword: asthma
keywords: asthma
collection events: EGAS00001003739 EGAS00001003739 1506_Methylation_M.vd.Berge
organisations involved: EGAS00001003739 UMCG
publisher: EGAS00001003739 UMCG
creator: EGAS00001003739 UMCG
people involved: EGAS00001003739 Maarten van den Berge
contact point: EGAS00001003739 Maarten van den Berge
access rights: http://umcgresearchdatacatalogue.nl/CatalogueOntologies/api/rdf/AccessRights/name=Non%20public
access rights: NON PUBLIC
theme: http://umcgresearchdatacatalogue.nl/CatalogueOntologies/api/rdf/Themes/name=Health
theme: HEAL
applicable legislation: http://umcgresearchdatacatalogue.nl/CatalogueOntologies/api/rdf/Legislations/name=Data%20Governance%20Act
applicable legislation: oj
mg_draft: false
mg_insertedOn: 2026-05-13T12:02:13
mg_updatedOn: 2026-05-13T12:02:13
mg_tableclass: catalogue_rdf.Collections

EGAS00001007021
type: Collections
type: Observation
type: Dataset
endpoint URL: catalogue_rdf
data set: Collections
hricore: true
id: EGAS00001007021
pid: https://metadata.ega-archive.org/studies/EGAS00001007021
title: Single-cell dissection of the immune response after a myocardial infarction
name: Single-cell dissection of the immune response after a myocardial infarction
type: http://umcgresearchdatacatalogue.nl/CatalogueOntologies/api/rdf/ResourceTypes/name=Cohort%20study
landing page: https://ega-archive.org/studies/EGAS00001007021
website: EGAS00001007021
description: The immune response plays a pivotal role in initiating cardiac repair and remodeling in both the acute and chronic phase after ST-Elevated myocardial infarction (STEMI). To dissect the longitudinal character of the immune response in STEMI patients over time, we performed single-cell RNA-sequencing (scRNA-seq) on a total of 95,995 peripheral blood mononuclear cells (PBMCs) collected from 38 STEMI patients at hospital admission, 24 hours (acute phase) and 6-8 weeks (chronic phase) after STEMI. Additionally, comparison to healthy controls was performed using previously generated scRNA-seq data on 33,878 PBMCs from 38 age- and sex-matched healthy controls from the Dutch population cohort Lifelines DEEP.
keyword: STEMI
keywords: STEMI
keyword: single-cell RNA sequencing
keywords: single-cell RNA sequencing
keyword: PMBC
keywords: PMBC
collection events: EGAS00001007021 EGAS00001007021 Single-cell dissection of the immune response after a myocardial infarction
number of unique individuals: 38
number of participants: 38
number of participants with samples: 38
countries: http://umcgresearchdatacatalogue.nl/CatalogueOntologies/api/rdf/Countries/name=Netherlands%20%28the%29
spatial: NLD
organisations involved: EGAS00001007021 UMCG
publisher: EGAS00001007021 UMCG
creator: EGAS00001007021 UMCG
people involved: EGAS00001007021 Monique van der Wijst
contact point: EGAS00001007021 Monique van der Wijst
access rights: http://umcgresearchdatacatalogue.nl/CatalogueOntologies/api/rdf/AccessRights/name=Non%20public
access rights: NON PUBLIC
theme: http://umcgresearchdatacatalogue.nl/CatalogueOntologies/api/rdf/Themes/name=Health
theme: HEAL
applicable legislation: http://umcgresearchdatacatalogue.nl/CatalogueOntologies/api/rdf/Legislations/name=Data%20Governance%20Act
applicable legislation: oj
mg_draft: false
mg_insertedOn: 2026-05-13T12:02:13
mg_updatedOn: 2026-05-13T12:02:13
mg_tableclass: catalogue_rdf.Collections

EGAS00001006258
type: Collections
type: Observation
type: Dataset
endpoint URL: catalogue_rdf
data set: Collections
hricore: true
id: EGAS00001006258
pid: https://metadata.ega-archive.org/studies/EGAS00001006258
title: The Gut Microbiome of liver transplant recipients – Cross-sectional + Longitudinal (renal and liver)
name: The Gut Microbiome of liver transplant recipients – Cross-sectional + Longitudinal (renal and liver)
type: http://umcgresearchdatacatalogue.nl/CatalogueOntologies/api/rdf/ResourceTypes/name=Cohort%20study
landing page: https://ega-archive.org/studies/EGAS00001006258
website: EGAS00001006258
description: TransplantLines is designed as a single-center, prospective cohort study and biobank including all different types of solid organ transplant recipients as well as living organ donors. In the TransplantLines gut microbiome study the gut microbiome of solid organ transplant recipients is characterized and linked to clinical phenotypes. This batch contains the cross-sectional data from liver transplant recipients and longitudinal data from renal and liver transplant recipients.
keyword: TransplantLines
keywords: TransplantLines
keyword: renal transplant recipients
keywords: renal transplant recipients
keyword: gut microbiome
keywords: gut microbiome
keyword: liver transplant recipients
keywords: liver transplant recipients
collection events: EGAS00001006258 EGAS00001006258 TransplantLines Gut Microbiome study
organisations involved: EGAS00001006258 UMCG
publisher: EGAS00001006258 UMCG
creator: EGAS00001006258 UMCG
access rights: http://umcgresearchdatacatalogue.nl/CatalogueOntologies/api/rdf/AccessRights/name=Non%20public
access rights: NON PUBLIC
theme: http://umcgresearchdatacatalogue.nl/CatalogueOntologies/api/rdf/Themes/name=Health
theme: HEAL
applicable legislation: http://umcgresearchdatacatalogue.nl/CatalogueOntologies/api/rdf/Legislations/name=Data%20Governance%20Act
applicable legislation: oj
mg_draft: false
mg_insertedOn: 2026-05-13T12:02:13
mg_updatedOn: 2026-05-13T12:02:13
mg_tableclass: catalogue_rdf.Collections

LIFELINES_NEXT Lifelines NEXT
type: Documentation
type: Observation
endpoint URL: catalogue_rdf
data set: Documentation
resource: LIFELINES_NEXT
name: Lifelines NEXT
description: Brochure with information on Lifelines NEXT that is distibuted to pregnant women who show interest in the study.
url: https://webshare.zenya.work/qtsdj3rpkggxms6b/Document.aspx
mg_insertedOn: 2026-05-13T12:02:13
mg_updatedOn: 2026-05-13T12:02:13

LIFELINES_NEXT Overview questionnaires Lifelines NEXT
type: Documentation
type: Observation
endpoint URL: catalogue_rdf
data set: Documentation
resource: LIFELINES_NEXT
name: Overview questionnaires Lifelines NEXT
description: Overview of subject in Lifelines NEXT questionnaires per time point. Orange lines are questionnaires that have been added to the study at a later time point upon request of collaborators.
url: https://webshare.zenya.work/qtsdj3rpkggxms6b/Document.aspx
mg_insertedOn: 2026-05-13T12:02:13
mg_updatedOn: 2026-05-13T12:02:13

AHON Factsheet AHON-database - Information for researchers
type: Documentation
type: Observation
endpoint URL: catalogue_rdf
data set: Documentation
resource: AHON
name: Factsheet AHON-database - Information for researchers
url: https://huisartsgeneeskunde-umcg.nl/system/files/factsheet_ahon-database_information_for_researchers.pdf
mg_insertedOn: 2026-05-13T12:02:13
mg_updatedOn: 2026-05-13T12:02:13

OncoLifeS OncoLifeS Template Study Protocol
type: Documentation
type: Observation
endpoint URL: catalogue_rdf
data set: Documentation
resource: OncoLifeS
name: OncoLifeS Template Study Protocol
url: https://webshare.zenya.work/9hdfbnd20bgcg8fz/Document.aspx
mg_insertedOn: 2026-05-13T12:02:13
mg_updatedOn: 2026-05-13T12:02:13

AcuteLines Cohort description
type: Documentation
type: Observation
endpoint URL: catalogue_rdf
data set: Documentation
resource: AcuteLines
name: Cohort description
url: https://bmjopen.bmj.com/content/11/7/e047349
mg_insertedOn: 2026-05-13T12:02:13
mg_updatedOn: 2026-05-13T12:02:13

AcuteLines Infographic
type: Documentation
type: Observation
endpoint URL: catalogue_rdf
data set: Documentation
resource: AcuteLines
name: Infographic
description: An infographic about the data and samples Acutelines collects
mg_insertedOn: 2026-05-13T12:02:13
mg_updatedOn: 2026-05-13T12:02:13

UMCG
type: Catalogues
type: Observation
type: Catalog
endpoint URL: catalogue_rdf
data set: Catalogues
membership resource: main_fdp
fdp endpoint: main_fdp
has member relation: metadataCatalog
ldp membership relation: metadataCatalog
hricore: true
id: UMCG
title: University Medical Center Groningen
name: University Medical Center Groningen
description: This metadata catalogue was commissioned by the University Medical Centre Groningen (UMCG). The aim of the UMCG Research Data Catalogue is to increase the visibility of UMCG data and sample resources and thereby stimulate their findability, accessibility and reuse, three major pillars of the FAIR principles. The UMCG Research Data Catalogue includes a wide variety of data and sample resources, from large population-based cohorts and clinical biobanks to studies and everything in between. Some resources date back all the way to 1962. The catalogue was developed by the Genomics Coordination Centre (GCC), the Cohort and Biobank Coordination Hub (CBCH) and the Digital Competence Center (DCC) of the UMCG.
dataset: EGAS00001000644
data resources: EGAS00001000644
dataset: OncoLifeS
data resources: OncoLifeS
dataset: AcuteLines
data resources: AcuteLines
dataset: AHON
data resources: AHON
dataset: LIFELINES_NEXT
data resources: LIFELINES_NEXT
organisations involved: UMCG UMCG
publisher: UMCG UMCG
creator: UMCG UMCG
people involved: UMCG Cohort and Biobank Coordination Hub
contact point: UMCG Cohort and Biobank Coordination Hub
applicable legislation: http://umcgresearchdatacatalogue.nl/CatalogueOntologies/api/rdf/Legislations/name=Data%20Governance%20Act
applicable legislation: oj
mg_draft: false
mg_insertedOn: 2026-05-13T12:02:14
mg_updatedOn: 2026-05-13T12:02:14
mg tableclass: catalogue_rdf.Catalogues

LIFELINES_NEXT 201501227
type: Internal identifiers
type: Observation
endpoint URL: catalogue_rdf
data set: Internal identifiers
resource: LIFELINES_NEXT
identifier: 201501227
internal identifier type: http://umcgresearchdatacatalogue.nl/CatalogueOntologies/api/rdf/InternalIdentifierTypes/name=UMCG%20register%20Utopia
mg_insertedOn: 2026-05-13T12:02:14
mg_updatedOn: 2026-05-13T12:02:14

LIFELINES_NEXT 5470
type: Internal identifiers
type: Observation
endpoint URL: catalogue_rdf
data set: Internal identifiers
resource: LIFELINES_NEXT
identifier: 5470
internal identifier type: http://umcgresearchdatacatalogue.nl/CatalogueOntologies/api/rdf/InternalIdentifierTypes/name=UMCG%20PaNaMaID
mg_insertedOn: 2026-05-13T12:02:14
mg_updatedOn: 2026-05-13T12:02:14

AHON 202100077
type: Internal identifiers
type: Observation
endpoint URL: catalogue_rdf
data set: Internal identifiers
resource: AHON
identifier: 202100077
internal identifier type: http://umcgresearchdatacatalogue.nl/CatalogueOntologies/api/rdf/InternalIdentifierTypes/name=UMCG%20register%20Utopia
mg_insertedOn: 2026-05-13T12:02:14
mg_updatedOn: 2026-05-13T12:02:14

AHON 9694
type: Internal identifiers
type: Observation
endpoint URL: catalogue_rdf
data set: Internal identifiers
resource: AHON
identifier: 9694
internal identifier type: http://umcgresearchdatacatalogue.nl/CatalogueOntologies/api/rdf/InternalIdentifierTypes/name=UMCG%20PaNaMaID
mg_insertedOn: 2026-05-13T12:02:14
mg_updatedOn: 2026-05-13T12:02:14

OncoLifeS 201500227
type: Internal identifiers
type: Observation
endpoint URL: catalogue_rdf
data set: Internal identifiers
resource: OncoLifeS
identifier: 201500227
internal identifier type: http://umcgresearchdatacatalogue.nl/CatalogueOntologies/api/rdf/InternalIdentifierTypes/name=UMCG%20register%20Utopia
mg_insertedOn: 2026-05-13T12:02:14
mg_updatedOn: 2026-05-13T12:02:14

AcuteLines 201900635
type: Internal identifiers
type: Observation
endpoint URL: catalogue_rdf
data set: Internal identifiers
resource: AcuteLines
identifier: 201900635
internal identifier type: http://umcgresearchdatacatalogue.nl/CatalogueOntologies/api/rdf/InternalIdentifierTypes/name=UMCG%20register%20Utopia
mg_insertedOn: 2026-05-13T12:02:14
mg_updatedOn: 2026-05-13T12:02:14

AcuteLines 8587
type: Internal identifiers
type: Observation
endpoint URL: catalogue_rdf
data set: Internal identifiers
resource: AcuteLines
identifier: 8587
internal identifier type: http://umcgresearchdatacatalogue.nl/CatalogueOntologies/api/rdf/InternalIdentifierTypes/name=UMCG%20PaNaMaID
mg_insertedOn: 2026-05-13T12:02:14
mg_updatedOn: 2026-05-13T12:02:14

LIFELINES_NEXT https://doi.org/10.1007/s10654-020-00614-7
type: Publications
type: Observation
endpoint URL: catalogue_rdf
data set: Publications
is part of: LIFELINES_NEXT
resource: LIFELINES_NEXT
doi: s10654-020-00614-7
title: Lifelines NEXT: a prospective birth cohort adding the next generation to the three‑generation Lifelines cohort study
is design publication: true
mg_insertedOn: 2026-05-13T12:02:14
mg_updatedOn: 2026-05-13T12:02:14

AHON https://doi.org/10.1093/ije/dyae021
type: Publications
type: Observation
endpoint URL: catalogue_rdf
data set: Publications
is part of: AHON
resource: AHON
doi: dyae021
title: Data Resource Profile: Registry of electronic health records of general practices in the north of The Netherlands (AHON)
is design publication: true
mg_insertedOn: 2026-05-13T12:02:14
mg_updatedOn: 2026-05-13T12:02:14

AHON https://doi.org/10.1177/17531934241235546
type: Publications
type: Observation
endpoint URL: catalogue_rdf
data set: Publications
is part of: AHON
resource: AHON
doi: https://doi.org/10.1177/17531934241235546
title: Mortality in patients with Dupuytren’s disease in the first 5 years after diagnosis: a population-based survival analysis
is design publication: false
mg_insertedOn: 2026-05-13T12:02:14
mg_updatedOn: 2026-05-13T12:02:14

AHON https://doi.org/10.2196/49944
type: Publications
type: Observation
endpoint URL: catalogue_rdf
data set: Publications
is part of: AHON
resource: AHON
doi: https://doi.org/10.2196/49944
title: A Natural Language Processing Model for COVID-19 Detection Based on Dutch General Practice Electronic Health Records by Using Bidirectional Encoder Representations From Transformers: Development and Validation Study
is design publication: false
mg_insertedOn: 2026-05-13T12:02:14
mg_updatedOn: 2026-05-13T12:02:14

AHON https://doi.org/10.1016/j.jpsychores.2024.111859
type: Publications
type: Observation
endpoint URL: catalogue_rdf
data set: Publications
is part of: AHON
resource: AHON
doi: j.jpsychores.2024.111859
title: Which patients are at risk of developing symptom diagnoses that persist for more than a year in primary care? Development and external validation of a prediction model
is design publication: false
mg_insertedOn: 2026-05-13T12:02:14
mg_updatedOn: 2026-05-13T12:02:14

AHON https://doi.org/10.3399/BJGP.2023.0489
type: Publications
type: Observation
endpoint URL: catalogue_rdf
data set: Publications
is part of: AHON
resource: AHON
doi: BJGP.2023.0489
title: Artificial Intelligence for early detection of lung cancer in General Practitioners’ clinical notes
is design publication: false
mg_insertedOn: 2026-05-13T12:02:14
mg_updatedOn: 2026-05-13T12:02:14

AHON https://doi.org/10.2196/64628
type: Publications
type: Observation
endpoint URL: catalogue_rdf
data set: Publications
is part of: AHON
resource: AHON
doi: https://doi.org/10.2196/64628
title: Implications of Data Extraction and Processing of Electronic Health Records for Epidemiological Research: Observational Study
is design publication: true
mg_draft: false
mg_insertedOn: 2026-05-13T12:02:14
mg_updatedOn: 2026-05-13T12:02:14

AHON https://doi.org/10.3399/BJGPO.2025.0052
type: Publications
type: Observation
endpoint URL: catalogue_rdf
data set: Publications
is part of: AHON
resource: AHON
doi: BJGPO.2025.0052
title: Anti-vertigo drug prescribing for patients with vestibular symptoms in primary care
is design publication: false
mg_draft: false
mg_insertedOn: 2026-05-13T12:02:14
mg_updatedOn: 2026-05-13T12:02:14

OncoLifeS https://doi.org/10.1186/s12967-019-2122-x
type: Publications
type: Observation
endpoint URL: catalogue_rdf
data set: Publications
is part of: OncoLifeS
resource: OncoLifeS
doi: s12967-019-2122-x
title: The OncoLifeS data-biobank for oncology: a comprehensive repository of clinical data, biological samples, and the patient's perspective
is design publication: true
mg_insertedOn: 2026-05-13T12:02:14
mg_updatedOn: 2026-05-13T12:02:14

EGAS00001000644 https://doi.org/10.1038/s41598-019-55109-7
type: Publications
type: Observation
endpoint URL: catalogue_rdf
data set: Publications
is part of: EGAS00001000644
resource: EGAS00001000644
doi: s41598-019-55109-7
title: WGS-based telomere length analysis in Dutch family trios implicates stronger maternal inheritance and a role for RRM1 gene.
mg_insertedOn: 2026-05-13T12:02:14
mg_updatedOn: 2026-05-13T12:02:14

EGAS00001000644 https://doi.org/10.1186/s12915-019-0674-0
type: Publications
type: Observation
endpoint URL: catalogue_rdf
data set: Publications
is part of: EGAS00001000644
resource: EGAS00001000644
doi: s12915-019-0674-0
title: RNA-Seq in 296 phased trios provides a high-resolution map of genomic imprinting.
mg_insertedOn: 2026-05-13T12:02:14
mg_updatedOn: 2026-05-13T12:02:14

EGAS00001000644 https://doi.org/10.1186/s12864-018-4482-7
type: Publications
type: Observation
endpoint URL: catalogue_rdf
data set: Publications
is part of: EGAS00001000644
resource: EGAS00001000644
doi: s12864-018-4482-7
title: A SNP panel for identification of DNA and RNA specimens.
mg_insertedOn: 2026-05-13T12:02:14
mg_updatedOn: 2026-05-13T12:02:14

EGAS00001000644 https://doi.org/10.1038/ncomms12989
type: Publications
type: Observation
endpoint URL: catalogue_rdf
data set: Publications
is part of: EGAS00001000644
resource: EGAS00001000644
doi: ncomms12989
title: A high-quality human reference panel reveals the complexity and distribution of genomic structural variants.
mg_insertedOn: 2026-05-13T12:02:14
mg_updatedOn: 2026-05-13T12:02:14

EGAS00001000644 https://doi.org/10.1101/gr.203216.115
type: Publications
type: Observation
endpoint URL: catalogue_rdf
data set: Publications
is part of: EGAS00001000644
resource: EGAS00001000644
doi: gr.203216.115
title: Transmission of human mtDNA heteroplasmy in the Genome of the Netherlands families: support for a variable-size bottleneck.
mg_insertedOn: 2026-05-13T12:02:14
mg_updatedOn: 2026-05-13T12:02:14

EGAS00001000644 https://doi.org/10.1038/ng.3292
type: Publications
type: Observation
endpoint URL: catalogue_rdf
data set: Publications
is part of: EGAS00001000644
resource: EGAS00001000644
doi: ng.3292
title: Genome-wide patterns and properties of de novo mutations in humans.
mg_insertedOn: 2026-05-13T12:02:14
mg_updatedOn: 2026-05-13T12:02:14

EGAS00001000644 https://doi.org/10.1101/gr.185041.114
type: Publications
type: Observation
endpoint URL: catalogue_rdf
data set: Publications
is part of: EGAS00001000644
resource: EGAS00001000644
doi: gr.185041.114
title: Characteristics of de novo structural changes in the human genome.
mg_insertedOn: 2026-05-13T12:02:14
mg_updatedOn: 2026-05-13T12:02:14

EGAS00001000644 https://doi.org/10.1038/ng.3021
type: Publications
type: Observation
endpoint URL: catalogue_rdf
data set: Publications
is part of: EGAS00001000644
resource: EGAS00001000644
doi: ng.3021
title: Whole-genome sequence variation, population structure and demographic history of the Dutch population.
mg_insertedOn: 2026-05-13T12:02:14
mg_updatedOn: 2026-05-13T12:02:14

EGAS00001000644 https://doi.org/10.1038/ejhg.2014.19
type: Publications
type: Observation
endpoint URL: catalogue_rdf
data set: Publications
is part of: EGAS00001000644
resource: EGAS00001000644
doi: ejhg.2014.19
title: Improved imputation quality of low-frequency and rare variants in European samples using the 'Genome of The Netherlands'.
mg_insertedOn: 2026-05-13T12:02:14
mg_updatedOn: 2026-05-13T12:02:14

EGAS00001000644 https://doi.org/10.1038/ejhg.2013.118
type: Publications
type: Observation
endpoint URL: catalogue_rdf
data set: Publications
is part of: EGAS00001000644
resource: EGAS00001000644
doi: ejhg.2013.118
title: The Genome of the Netherlands: design, and project goals.
mg_insertedOn: 2026-05-13T12:02:14
mg_updatedOn: 2026-05-13T12:02:14

EGAS00001005027 https://doi.org/10.1038/s41467-023-37396-x
type: Publications
type: Observation
endpoint URL: catalogue_rdf
data set: Publications
is part of: EGAS00001005027
resource: EGAS00001005027
doi: s41467-023-37396-x
title: The genomic landscape of reference genomes of cultivated human gut bacteria.
mg_insertedOn: 2026-05-13T12:02:14
mg_updatedOn: 2026-05-13T12:02:14

EGAS00001006999 https://doi.org/10.1186/s40168-024-01858-1
type: Publications
type: Observation
endpoint URL: catalogue_rdf
data set: Publications
is part of: EGAS00001006999
resource: EGAS00001006999
doi: s40168-024-01858-1
title: Systemic antibody responses against gut microbiota flagellins implicate shared and divergent immune reactivity in Crohn's disease and chronic fatigue syndrome.
mg_insertedOn: 2026-05-13T12:02:14
mg_updatedOn: 2026-05-13T12:02:14

EGAS00001002169 https://doi.org/10.1186/s12864-016-3452-1
type: Publications
type: Observation
endpoint URL: catalogue_rdf
data set: Publications
is part of: EGAS00001002169
resource: EGAS00001002169
doi: s12864-016-3452-1
title: The emerging landscape of dynamic DNA methylation in early childhood.
mg_insertedOn: 2026-05-13T12:02:14
mg_updatedOn: 2026-05-13T12:02:14

EGAS00001002560 https://doi.org/10.1186/s13059-023-02897-x
type: Publications
type: Observation
endpoint URL: catalogue_rdf
data set: Publications
is part of: EGAS00001002560
resource: EGAS00001002560
doi: s13059-023-02897-x
title: Identification of genetic variants that impact gene co-expression relationships using large-scale single-cell data.
mg_insertedOn: 2026-05-13T12:02:14
mg_updatedOn: 2026-05-13T12:02:14

EGAS00001002560 https://doi.org/10.1038/s41467-021-23196-8
type: Publications
type: Observation
endpoint URL: catalogue_rdf
data set: Publications
is part of: EGAS00001002560
resource: EGAS00001002560
doi: s41467-021-23196-8
title: Hierarchical progressive learning of cell identities in single-cell data.
mg_insertedOn: 2026-05-13T12:02:14
mg_updatedOn: 2026-05-13T12:02:14

EGAS00001002560 https://doi.org/10.1101/gr.261115.120
type: Publications
type: Observation
endpoint URL: catalogue_rdf
data set: Publications
is part of: EGAS00001002560
resource: EGAS00001002560
doi: gr.261115.120
title: Alignment of single-cell RNA-seq samples without overcorrection using kernel density matching.
mg_insertedOn: 2026-05-13T12:02:14
mg_updatedOn: 2026-05-13T12:02:14

EGAS00001002560 https://doi.org/10.1016/j.cels.2019.10.007
type: Publications
type: Observation
endpoint URL: catalogue_rdf
data set: Publications
is part of: EGAS00001002560
resource: EGAS00001002560
doi: j.cels.2019.10.007
title: Reconstruction of Cell-type-Specific Interactomes at Single-Cell Resolution.
mg_insertedOn: 2026-05-13T12:02:14
mg_updatedOn: 2026-05-13T12:02:14

EGAS00001002560 https://doi.org/10.1038/s41588-018-0089-9
type: Publications
type: Observation
endpoint URL: catalogue_rdf
data set: Publications
is part of: EGAS00001002560
resource: EGAS00001002560
doi: s41588-018-0089-9
title: Single-cell RNA sequencing identifies celltype-specific cis-eQTLs and co-expression QTLs.
mg_insertedOn: 2026-05-13T12:02:14
mg_updatedOn: 2026-05-13T12:02:14

EGAS00001003735 https://doi.org/10.1186/s12931-023-02430-5
type: Publications
type: Observation
endpoint URL: catalogue_rdf
data set: Publications
is part of: EGAS00001003735
resource: EGAS00001003735
doi: s12931-023-02430-5
title: Smoking increases expression of the SARS-CoV-2 spike protein-binding long ACE2 isoform in bronchial epithelium.
mg_insertedOn: 2026-05-13T12:02:14
mg_updatedOn: 2026-05-13T12:02:14

EGAS00001003735 https://doi.org/10.1111/cea.13732
type: Publications
type: Observation
endpoint URL: catalogue_rdf
data set: Publications
is part of: EGAS00001003735
resource: EGAS00001003735
doi: cea.13732
title: Gene signatures from scRNA-seq accurately quantify mast cells in biopsies in asthma.
mg_insertedOn: 2026-05-13T12:02:14
mg_updatedOn: 2026-05-13T12:02:14

EGAS00001003735 https://doi.org/10.1038/s41598-020-74121-w
type: Publications
type: Observation
endpoint URL: catalogue_rdf
data set: Publications
is part of: EGAS00001003735
resource: EGAS00001003735
doi: s41598-020-74121-w
title: Genetic regulation of gene expression of MIF family members in lung tissue.
mg_insertedOn: 2026-05-13T12:02:14
mg_updatedOn: 2026-05-13T12:02:14

EGAS00001003805 https://doi.org/10.3389/fgene.2020.562434
type: Publications
type: Observation
endpoint URL: catalogue_rdf
data set: Publications
is part of: EGAS00001003805
resource: EGAS00001003805
doi: fgene.2020.562434
title: Systematic Prioritization of Candidate Genes in Disease Loci Identifies TRAFD1 as a Master Regulator of IFNγ Signaling in Celiac Disease.
mg_insertedOn: 2026-05-13T12:02:14
mg_updatedOn: 2026-05-13T12:02:14

EGAS00001003805 https://doi.org/10.1038/s41431-019-0520-4
type: Publications
type: Observation
endpoint URL: catalogue_rdf
data set: Publications
is part of: EGAS00001003805
resource: EGAS00001003805
doi: s41431-019-0520-4
title: Immunochip meta-analysis in European and Argentinian populations identifies two novel genetic loci associated with celiac disease.
mg_insertedOn: 2026-05-13T12:02:14
mg_updatedOn: 2026-05-13T12:02:14

EGAS00001004766 https://doi.org/10.1186/s13601-020-00365-4
type: Publications
type: Observation
endpoint URL: catalogue_rdf
data set: Publications
is part of: EGAS00001004766
resource: EGAS00001004766
doi: s13601-020-00365-4
title: Epigenome-wide association study identifies DNA methylation markers for asthma remission in whole blood and nasal epithelium.
mg_insertedOn: 2026-05-13T12:02:14
mg_updatedOn: 2026-05-13T12:02:14

EGAS00001005027 https://doi.org/10.1038/s41586-023-06893-w
type: Publications
type: Observation
endpoint URL: catalogue_rdf
data set: Publications
is part of: EGAS00001005027
resource: EGAS00001005027
doi: s41586-023-06893-w
title: Host genetic regulation of human gut microbial structural variation.
mg_insertedOn: 2026-05-13T12:02:14
mg_updatedOn: 2026-05-13T12:02:14

EGAS00001005027 https://doi.org/10.3389/fmicb.2023.1223120
type: Publications
type: Observation
endpoint URL: catalogue_rdf
data set: Publications
is part of: EGAS00001005027
resource: EGAS00001005027
doi: fmicb.2023.1223120
title: Impact of occupational pesticide exposure on the human gut microbiome.
mg_insertedOn: 2026-05-13T12:02:14
mg_updatedOn: 2026-05-13T12:02:14

EGAS00001005027 https://doi.org/10.3389/fcimb.2023.1202035
type: Publications
type: Observation
endpoint URL: catalogue_rdf
data set: Publications
is part of: EGAS00001005027
resource: EGAS00001005027
doi: fcimb.2023.1202035
title: Gut dysbiosis associates with cytokine production capacity in viral-suppressed people living with HIV.
mg_insertedOn: 2026-05-13T12:02:14
mg_updatedOn: 2026-05-13T12:02:14

EGAS00001005189 https://doi.org/10.1016/j.pccm.2024.02.002
type: Publications
type: Observation
endpoint URL: catalogue_rdf
data set: Publications
is part of: EGAS00001005189
resource: EGAS00001005189
doi: j.pccm.2024.02.002
title: Omics approaches in asthma research: Challenges and opportunities.
mg_insertedOn: 2026-05-13T12:02:14
mg_updatedOn: 2026-05-13T12:02:14

EGAS00001005189 https://doi.org/10.1038/s41467-022-35088-6
type: Publications
type: Observation
endpoint URL: catalogue_rdf
data set: Publications
is part of: EGAS00001005189
resource: EGAS00001005189
doi: s41467-022-35088-6
title: Nasal DNA methylation at three CpG sites predicts childhood allergic disease.
mg_insertedOn: 2026-05-13T12:02:14
mg_updatedOn: 2026-05-13T12:02:14

EGAS00001005376 https://doi.org/10.1186/s13059-023-02897-x
type: Publications
type: Observation
endpoint URL: catalogue_rdf
data set: Publications
is part of: EGAS00001005376
resource: EGAS00001005376
doi: s13059-023-02897-x
title: Identification of genetic variants that impact gene co-expression relationships using large-scale single-cell data.
mg_insertedOn: 2026-05-13T12:02:14
mg_updatedOn: 2026-05-13T12:02:14

EGAS00001005376 https://doi.org/10.1038/s42003-022-03521-7
type: Publications
type: Observation
endpoint URL: catalogue_rdf
data set: Publications
is part of: EGAS00001005376
resource: EGAS00001005376
doi: s42003-022-03521-7
title: Genetic, parental and lifestyle factors influence telomere length.
mg_insertedOn: 2026-05-13T12:02:14
mg_updatedOn: 2026-05-13T12:02:14

EGAS00001005376 https://doi.org/10.1038/s41467-022-30893-5
type: Publications
type: Observation
endpoint URL: catalogue_rdf
data set: Publications
is part of: EGAS00001005376
resource: EGAS00001005376
doi: s41467-022-30893-5
title: Single-cell RNA-sequencing of peripheral blood mononuclear cells reveals widespread, context-specific gene expression regulation upon pathogenic exposure.
mg_insertedOn: 2026-05-13T12:02:14
mg_updatedOn: 2026-05-13T12:02:14

EGAS00001006347 https://doi.org/10.1038/s41598-024-73743-8
type: Publications
type: Observation
endpoint URL: catalogue_rdf
data set: Publications
is part of: EGAS00001006347
resource: EGAS00001006347
doi: s41598-024-73743-8
title: Characterizing the allele-specific gene expression landscape in high hyperdiploid acute lymphoblastic leukemia with BASE.
mg_insertedOn: 2026-05-13T12:02:14
mg_updatedOn: 2026-05-13T12:02:14

EGAS00001006347 https://doi.org/10.1038/s41467-023-37356-5
type: Publications
type: Observation
endpoint URL: catalogue_rdf
data set: Publications
is part of: EGAS00001006347
resource: EGAS00001006347
doi: s41467-023-37356-5
title: Clonal origin and development of high hyperdiploidy in childhood acute lymphoblastic leukaemia.
mg_insertedOn: 2026-05-13T12:02:14
mg_updatedOn: 2026-05-13T12:02:14

EGAS00001006657 https://doi.org/10.1038/s41467-022-35088-6
type: Publications
type: Observation
endpoint URL: catalogue_rdf
data set: Publications
is part of: EGAS00001006657
resource: EGAS00001006657
doi: s41467-022-35088-6
title: Nasal DNA methylation at three CpG sites predicts childhood allergic disease.
mg_insertedOn: 2026-05-13T12:02:14
mg_updatedOn: 2026-05-13T12:02:14

EGAS00001007054 https://doi.org/10.1186/s40168-024-01858-1
type: Publications
type: Observation
endpoint URL: catalogue_rdf
data set: Publications
is part of: EGAS00001007054
resource: EGAS00001007054
doi: s40168-024-01858-1
title: Systemic antibody responses against gut microbiota flagellins implicate shared and divergent immune reactivity in Crohn's disease and chronic fatigue syndrome.
mg_insertedOn: 2026-05-13T12:02:14
mg_updatedOn: 2026-05-13T12:02:14

EGAS00001007450 https://doi.org/10.1136/thorax-2023-220230
type: Publications
type: Observation
endpoint URL: catalogue_rdf
data set: Publications
is part of: EGAS00001007450
resource: EGAS00001007450
doi: thorax-2023-220230
title: Airway epithelial cell response to RSV is mostly impaired in goblet and multiciliated cells in asthma.
mg_insertedOn: 2026-05-13T12:02:14
mg_updatedOn: 2026-05-13T12:02:14

EGAS50000000133 https://doi.org/10.1007/s10654-020-00614-7
type: Publications
type: Observation
endpoint URL: catalogue_rdf
data set: Publications
is part of: EGAS50000000133
resource: EGAS50000000133
doi: s10654-020-00614-7
title: Lifelines NEXT: a prospective birth cohort adding the next generation to the three-generation Lifelines cohort study.
mg_insertedOn: 2026-05-13T12:02:14
mg_updatedOn: 2026-05-13T12:02:14

EGAS50000000483 https://doi.org/10.1038/s41467-024-52098-8
type: Publications
type: Observation
endpoint URL: catalogue_rdf
data set: Publications
is part of: EGAS50000000483
resource: EGAS50000000483
doi: s41467-024-52098-8
title: Neoadjuvant immune checkpoint blockade in women with mismatch repair deficient endometrial cancer: a phase I study.
mg_insertedOn: 2026-05-13T12:02:14
mg_updatedOn: 2026-05-13T12:02:14

PSI IBD https://doi.org/10.1186/s12876-018-0917-5
type: Publications
type: Observation
endpoint URL: catalogue_rdf
data set: Publications
is part of: PSI IBD
resource: PSI IBD
doi: s12876-018-0917-5
title: The 1000IBD project: multi-omics data of 1000 inflammatory bowel disease patients; data release 1
is design publication: true
mg_insertedOn: 2026-05-13T12:02:14
mg_updatedOn: 2026-05-13T12:02:14

PSI IBD https://doi.org/10.1136/bmjopen-2017-016695
type: Publications
type: Observation
endpoint URL: catalogue_rdf
data set: Publications
is part of: PSI IBD
resource: PSI IBD
doi: bmjopen-2017-016695
title: Cohort profile: design and first results of the Dutch IBD Biobank: a prospective, nationwide biobank of patients with inflammatory bowel disease
is design publication: true
mg_insertedOn: 2026-05-13T12:02:14
mg_updatedOn: 2026-05-13T12:02:14